Image 01
profile-image

alphaonex86

BRULE Herman amiens, France
GX Mail Notify

Plasma 4 Extensions by Goffix 124 comments

And about the tls support for crypt without ssl and the same port the communication? - Jul 24 2009
GX Mail Notify

Plasma 4 Extensions by Goffix 124 comments

Good job, bug the tls support is missing! And support seft signed certificate on demand pls! - Jul 24 2009
KpGen

Security by ammorais 8 comments

QMAKESPEC set to linux-g++ overrides mkspec of selected qt /usr/share/qt4/mkspecs/linux-g++
Running build steps for project kpgen...
Starting: /usr/bin/qmake /home/user/kpgen/src/kpgen.pro -spec /usr/share/qt4/mkspecs/linux-g++ -r
Exited with code 0.
Starting: /usr/bin/make -w
make: Entering directory `/home/user/kpgen/src'
/usr/bin/make -f Makefile.Debug
make[1]: Entering directory `/home/user/kpgen/src'
/usr/bin/uic kpgen.ui -o .ui/ui_kpgen.h
g++ -c -pipe -g -Wall -W -D_REENTRANT -DKPGEN_USE_SYSTEM_TRAY -DKPGEN_USE_CRYPTOPP -DTRANSLATION_PATH= -DKPGEN_VERSION= -DKPGEN_CUSTOM_VERSION= -DKPGEN_BUILDNUMBER= -DQT_GUI_LIB -DQT_CORE_LIB -DQT_SHARED -I/usr/share/qt4/mkspecs/linux-g++ -I. -I/usr/include/qt4/QtCore -I/usr/include/qt4/QtGui -I/usr/include/qt4 -I.moc -I.ui -o .obj/main.o main.cpp
In file included from main.cpp:30:
kpgen.h:46:28: error: cryptopp/tiger.h: No such file or directory
kpgen.h:47:31: error: cryptopp/whrlpool.h: No such file or directory
kpgen.h:48:29: error: cryptopp/ripemd.h: No such file or directory
kpgen.h:51:26: error: cryptopp/md2.h: No such file or directory
kpgen.h:52:26: error: cryptopp/md4.h: No such file or directory
kpgen.h:53:26: error: cryptopp/md5.h: No such file or directory
kpgen.h:55:26: error: cryptopp/sha.h: No such file or directory
kpgen.h:56:26: error: cryptopp/hex.h: No such file or directory
In file included from kpgen.h:64,
from main.cpp:30:
randomgenerator.h:33:31: error: cryptopp/randpool.h: No such file or directory
randomgenerator.h:34:28: error: cryptopp/osrng.h: No such file or directory
In file included from kpgen.h:64,
from main.cpp:30:
randomgenerator.h:61: error: 'CryptoPP' has not been declared
randomgenerator.h:61: error: ISO C++ forbids declaration of 'RandomPool' with no type
randomgenerator.h:61: error: expected ';' before 'ranPool'
randomgenerator.h:62: error: 'CryptoPP' has not been declared
randomgenerator.h:62: error: ISO C++ forbids declaration of 'AutoSeededRandomPool' with no type
randomgenerator.h:62: error: expected ';' before 'autoRanPool'
make[1]: Leaving directory `/home/user/kpgen/src'
make[1]: *** [.obj/main.o] Error 1
make: *** [debug] Error 2
make: Leaving directory `/home/user/kpgen/src'
Exited with code 2.
Error while building project kpgen
When executing build step 'Make' - Jun 20 2009
5 .8
9   Oct 02 2010