Image 01
profile-image

cafeina

Witold Krakowski , Italy
test
Customizable Weather Plasmoid (CWP)

Plasma 4 Extensions 1069 comments

Score 84.7%
Sep 02 2017
Yes, I noticed and I got new xml files. I also put the city identifier as in the example pogodynka.pl (°C) (city identifier example: Warszawa)
But it won'g work. - Oct 31 2010
Pogodynka.pl weather provider doesn't work. I tried getting new xml files but still nothing. I tried other providers and they work. Pogodynka.pl web page works correctly in a browser. Can you have a look at this issue?

Thanks,

Witold - Oct 30 2010
kX Generator

System Software 79 comments

Score 46.0%
Jan 02 2007
Also, it's not possible to download the 3.7 source... - Mar 10 2008
Too bad that the website doesn't work...
I see the following error message:

The requested URL /kxgenerator was not found on this server.

- Mar 10 2008
Multi Timer Qt

Various KDE Stuff 3 comments

Score 50.0%
Aug 08 2005
..but I get the whole bunch of errors (make output follows)

Makefile:233: warning: overriding commands for target `moc_timertabpage.cpp'
Makefile:221: warning: ignoring old commands for target `moc_timertabpage.cpp'
g++ -c -pipe -Wall -W -O2 -DQT_NO_DEBUG -DQT_SHARED -DQT_THREAD_SUPPORT -I/usr/lib/qt/mkspecs/default -I. -I/usr/lib/qt/include -o main.o main.cpp
main.cpp:16:24: error: QApplication: No such file or directory
main.cpp:17:23: error: QPushButton: No such file or directory
main.cpp:18:21: error: QSettings: No such file or directory
main.cpp:19:23: error: QMessageBox: No such file or directory
main.cpp:20:23: error: QTranslator: No such file or directory
main.cpp:21:19: error: QLocale: No such file or directory
In file included from main.cpp:23:
multitimermainwindow.h:18:23: error: QMainWindow: No such file or directory
multitimermainwindow.h:25: error: expected class-name before '{' token
multitimermainwindow.h:26: error: ISO C++ forbids declaration of 'Q_OBJECT' with no type
multitimermainwindow.h:27: error: expected ';' before 'public'
multitimermainwindow.h:31: error: expected `:' before 'slots'
multitimermainwindow.h:32: error: expected primary-expression before 'void'
multitimermainwindow.h:32: error: ISO C++ forbids declaration of 'slots' with no type
multitimermainwindow.h:32: error: expected ';' before 'void'
main.cpp: In function 'int main(int, char**)':
main.cpp:27: error: 'QApplication' was not declared in this scope
main.cpp:27: error: expected `;' before 'app'
main.cpp:29: error: 'QTranslator' was not declared in this scope
main.cpp:29: error: expected `;' before 'qtTranslator'
main.cpp:30: error: 'qtTranslator' was not declared in this scope
main.cpp:30: error: 'QLocale' has not been declared
main.cpp:31: error: 'app' was not declared in this scope
main.cpp:33: error: expected `;' before 'multiTimerQtTranslator'
main.cpp:34: error: 'multiTimerQtTranslator' was not declared in this scope
main.cpp:34: error: 'QLocale' has not been declared
main.cpp:37: error: variable 'QSettings settings' has initializer but incomplete type
main.cpp:37: error: incomplete type 'QSettings' used in nested name specifier
main.cpp:42: error: 'QMessageBox' has not been declared
main.cpp:42: error: 'QString' was not declared in this scope
main.cpp:42: error: 'QObject' has not been declared
main.cpp:42: error: 'QMessageBox' has not been declared
main.cpp:47: error: 'class MultiTimerMainWindow' has no member named 'show'
main.cpp: At global scope:
main.cpp:25: warning: unused parameter 'argc'
main.cpp:25: warning: unused parameter 'argv'
make: *** [main.o] Error 1 - Oct 09 2007
KCheckGMail

Email 88 comments

Score 50.0%
Jan 14 2010
Oh, I guess that I'll just have to wait for ubuntu to upgrade the version to 0.5.6 (right now it is 0.5.5). - May 13 2007
I'm using KCheckGMail on Kubuntu 7.04 with polish language setting. It seems to me that KCheckGMail has problems with polish chars, because they're not displayed correctly. Can You please check it? (All the rest of my system displays polish characters properly.) - May 13 2007