Image 01
profile-image

cebo

andrew morris
KardsGT

Card by JadziaMD 46 comments

with kubuntu feisty i get the following probs with make:

euchreinterfacebase.cpp: In constructor ‘EuchreInterfaceBase::EuchreInterfaceBase(QWidget*, const char*, uint)’:
euchreinterfacebase.cpp:32: error: invalid use of undefined type ‘struct KardPlayer’
euchreinterfacebase.h:20: error: forward declaration of ‘struct KardPlayer’
euchreinterfacebase.cpp:33: error: invalid use of undefined type ‘struct KardPlayer’
euchreinterfacebase.h:20: error: forward declaration of ‘struct KardPlayer’
euchreinterfacebase.cpp:35: error: invalid use of undefined type ‘struct KardSequence’
euchreinterfacebase.h:21: error: forward declaration of ‘struct KardSequence’
euchreinterfacebase.cpp:36: error: invalid use of undefined type ‘struct KardSequence’
euchreinterfacebase.h:21: error: forward declaration of ‘struct KardSequence’
euchreinterfacebase.cpp:38: error: invalid use of undefined type ‘struct KardPlayer’
euchreinterfacebase.h:20: error: forward declaration of ‘struct KardPlayer’
euchreinterfacebase.cpp:39: error: invalid use of undefined type ‘struct KardPlayer’
euchreinterfacebase.h:20: error: forward declaration of ‘struct KardPlayer’
euchreinterfacebase.cpp:41: error: invalid use of undefined type ‘struct KardPlayer’
euchreinterfacebase.h:20: error: forward declaration of ‘struct KardPlayer’
euchreinterfacebase.cpp:42: error: invalid use of undefined type ‘struct KardPlayer’
euchreinterfacebase.h:20: error: forward declaration of ‘struct KardPlayer’
euchreinterfacebase.cpp:44: error: invalid use of undefined type ‘struct KardPlayer’
euchreinterfacebase.h:20: error: forward declaration of ‘struct KardPlayer’
euchreinterfacebase.cpp:45: error: invalid use of undefined type ‘struct KardPlayer’
euchreinterfacebase.h:20: error: forward declaration of ‘struct KardPlayer’
euchreinterfacebase.cpp:47: error: invalid use of undefined type ‘struct KardSequence’
euchreinterfacebase.h:21: error: forward declaration of ‘struct KardSequence’
euchreinterfacebase.cpp:48: error: invalid use of undefined type ‘struct KardSequence’
euchreinterfacebase.h:21: error: forward declaration of ‘struct KardSequence’
euchreinterfacebase.cpp:49: error: invalid use of undefined type ‘struct KardSequence’
euchreinterfacebase.h:21: error: forward declaration of ‘struct KardSequence’
euchreinterfacebase.cpp:51: error: invalid use of undefined type ‘struct KardSequence’
euchreinterfacebase.h:21: error: forward declaration of ‘struct KardSequence’
euchreinterfacebase.cpp:52: error: invalid use of undefined type ‘struct KardSequence’
euchreinterfacebase.h:21: error: forward declaration of ‘struct KardSequence’
euchreinterfacebase.cpp:53: error: invalid use of undefined type ‘struct KardSequence’
euchreinterfacebase.h:21: error: forward declaration of ‘struct KardSequence’
euchreinterfacebase.cpp:55: error: invalid use of undefined type ‘struct KardPile’
euchreinterfacebase.h:22: error: forward declaration of ‘struct KardPile’
euchreinterfacebase.cpp:56: error: invalid use of undefined type ‘struct KardPile’
euchreinterfacebase.h:22: error: forward declaration of ‘struct KardPile’
euchreinterfacebase.cpp:58: error: invalid use of undefined type ‘struct KardPlaySequence’
euchreinterfacebase.h:23: error: forward declaration of ‘struct KardPlaySequence’
euchreinterfacebase.cpp:59: error: invalid use of undefined type ‘struct KardPlaySequence’
euchreinterfacebase.h:23: error: forward declaration of ‘struct KardPlaySequence’
euchreinterfacebase.cpp:60: error: invalid use of undefined type ‘struct KardPlaySequence’
euchreinterfacebase.h:23: error: forward declaration of ‘struct KardPlaySequence’
euchreinterfacebase.cpp:62: error: invalid use of undefined type ‘struct KardSequence’
euchreinterfacebase.h:21: error: forward declaration of ‘struct KardSequence’
euchreinterfacebase.cpp:63: error: invalid use of undefined type ‘struct KardSequence’
euchreinterfacebase.h:21: error: forward declaration of ‘struct KardSequence’
euchreinterfacebase.cpp:64: error: invalid use of undefined type ‘struct KardSequence’
euchreinterfacebase.h:21: error: forward declaration of ‘struct KardSequence’
make[2]: *** [euchreinterfacebase.o] Error 1
make[2]: Leaving directory `/home/drew/kardsgt-0.6.3/src-0.6.3/src/games/euchre'
make[1]: *** [sub-src-games-euchre] Error 2
make[1]: Leaving directory `/home/drew/kardsgt-0.6.3/src-0.6.3'
make: *** [KardsGT] Error 2

As far as I can tell all needed libraries are installed. Any ideas? - Aug 05 2007
Tuxum InitManager

System Software by dmoreno 3 comments

Hi,
I get the same error with Kubuntu feisty. - Jul 21 2007
KNetDockApp

Network by yodor 109 comments

This is what I get:

drew@cebo:~/knetdockapp-0.72$ make
make all-recursive
make[1]: Entering directory `/home/drew/knetdockapp-0.72'
Making all in doc
make[2]: Entering directory `/home/drew/knetdockapp-0.72/doc'
Making all in .
make[3]: Entering directory `/home/drew/knetdockapp-0.72/doc'
make[3]: Nothing to be done for `all-am'.
make[3]: Leaving directory `/home/drew/knetdockapp-0.72/doc'
Making all in en
make[3]: Entering directory `/home/drew/knetdockapp-0.72/doc/en'
/usr/bin/meinproc --check --cache index.cache.bz2 ./index.docbook
make[3]: Leaving directory `/home/drew/knetdockapp-0.72/doc/en'
make[2]: Leaving directory `/home/drew/knetdockapp-0.72/doc'
Making all in po
make[2]: Entering directory `/home/drew/knetdockapp-0.72/po'
make[2]: Nothing to be done for `all'.
make[2]: Leaving directory `/home/drew/knetdockapp-0.72/po'
Making all in src
make[2]: Entering directory `/home/drew/knetdockapp-0.72/src'
rm -rf WifiNetDetails.h;
/usr/share/qt3/bin/uic -L /usr/lib/kde3/plugins/designer -nounload ./WifiNetDetails.ui | /usr/bin/perl -pi -e "s,public QWizard,public KWizard,g; s,#include <qwizard.h>,#include <kwizard.h>,g" >> WifiNetDetails.h ;
rm -rf alarms.h;
/usr/share/qt3/bin/uic -L /usr/lib/kde3/plugins/designer -nounload ./alarms.ui | /usr/bin/perl -pi -e "s,public QWizard,public KWizard,g; s,#include <qwizard.h>,#include <kwizard.h>,g" >> alarms.h ;
rm -rf wifiscan.h;
/usr/share/qt3/bin/uic -L /usr/lib/kde3/plugins/designer -nounload ./wifiscan.ui | /usr/bin/perl -pi -e "s,public QWizard,public KWizard,g; s,#include <qwizard.h>,#include <kwizard.h>,g" >> wifiscan.h ;
if g++ -DHAVE_CONFIG_H -I. -I. -I.. -I/usr/include/kde -I/usr/share/qt3/include -I. -DQT_THREAD_SUPPORT -D_REENTRANT -Wno-long-long -Wundef -ansi -D_XOPEN_SOURCE=500 -D_BSD_SOURCE -Wcast-align -Wconversion -Wchar-subscripts -Wall -W -Wpointer-arith -O2 -Wformat-security -Wmissing-format-attribute -Wno-non-virtual-dtor -fno-exceptions -fno-check-new -fno-common -fexceptions -MT propspane.o -MD -MP -MF ".deps/propspane.Tpo" -c -o propspane.o propspane.cpp; \
then mv -f ".deps/propspane.Tpo" ".deps/propspane.Po"; else rm -f ".deps/propspane.Tpo"; exit 1; fi
/usr/include/linux/if_link.h:43: error: ‘__u64’ does not name a type
/usr/include/linux/if_link.h:44: error: ‘__u64’ does not name a type
/usr/include/linux/if_link.h:45: error: ‘__u64’ does not name a type
/usr/include/linux/neighbour.h:92: error: ‘__u64’ does not name a type
/usr/include/linux/neighbour.h:93: error: ‘__u64’ does not name a type
/usr/include/linux/neighbour.h:94: error: ‘__u64’ does not name a type
/usr/include/linux/neighbour.h:95: error: ‘__u64’ does not name a type
/usr/include/linux/neighbour.h:96: error: ‘__u64’ does not name a type
/usr/include/linux/neighbour.h:97: error: ‘__u64’ does not name a type
/usr/include/linux/neighbour.h:98: error: ‘__u64’ does not name a type
/usr/include/linux/neighbour.h:99: error: ‘__u64’ does not name a type
/usr/include/linux/neighbour.h:100: error: ‘__u64’ does not name a type
/usr/include/linux/neighbour.h:101: error: ‘__u64’ does not name a type
make[2]: *** [propspane.o] Error 1
make[2]: Leaving directory `/home/drew/knetdockapp-0.72/src'
make[1]: *** [all-recursive] Error 1
make[1]: Leaving directory `/home/drew/knetdockapp-0.72'
make: *** [all] Error 2

kubuntu 7.04
2.6.20-15-generic

If I remove -ansi everything is sweet


- Jun 22 2007
KNetDockApp

Network by yodor 109 comments

This happened to me also, I googled it and found the solution is to have a look in the knetdockapp-0.71/admin directory and edit the file acinclude.m4.in - remove the -ansi flag. Just find that term in the file and remove it. I was then able to make and make install and it works very nicely. - Jun 19 2007