Image 01
profile-image

coolpcguy

Sathyajith Bhat Mangalore, India
Plasma WiFi

Plasma 4 Extensions by ochoha 52 comments

Hey I cant compile this on KDE 4.1.3, Fedora 10. Here's what I get on exec'ing make
Quote:
Generating plasma-wifi-signal.moc
Scanning dependencies of target plasma_applet_wifi_signal
[ 50%] Building CXX object CMakeFiles/plasma_applet_wifi_signal.dir/plasma_applet_wifi_signal_automoc.o
[100%] Building CXX object CMakeFiles/plasma_applet_wifi_signal.dir/plasma-wifi-signal.o
/home/Sathyajith/Plasmoids/plasma-wifi-0.3/plasma-wifi-signal.cpp: In constructor ‘Plasma_WiFi_Signal_Strength::Plasma_WiFi_Signal_Strength(QObject*, const QVariantList&)’:
/home/Sathyajith/Plasmoids/plasma-wifi-0.3/plasma-wifi-signal.cpp:37: error: ‘setDrawStandardBackground’ was not declared in this scope
/home/Sathyajith/Plasmoids/plasma-wifi-0.3/plasma-wifi-signal.cpp: In member function ‘virtual void Plasma_WiFi_Signal_Strength::init()’:
/home/Sathyajith/Plasmoids/plasma-wifi-0.3/plasma-wifi-signal.cpp:57: error: ‘self’ is not a member of ‘Plasma::Theme’
/home/Sathyajith/Plasmoids/plasma-wifi-0.3/plasma-wifi-signal.cpp:58: error: ‘self’ is not a member of ‘Plasma::Theme’
/home/Sathyajith/Plasmoids/plasma-wifi-0.3/plasma-wifi-signal.cpp: In member function ‘void Plasma_WiFi_Signal_Strength::paintAntenna(QPainter*, const QRect&)’:
/home/Sathyajith/Plasmoids/plasma-wifi-0.3/plasma-wifi-signal.cpp:115: error: no matching function for call to ‘Plasma::Svg::Svg(QString&, Plasma_WiFi_Signal_Strength* const)’
/usr/include/kde4/plasma/svg.h:73: note: candidates are: Plasma::Svg::Svg(QObject*)
/usr/include/kde4/plasma/svg.h:51: note: Plasma::Svg::Svg(const Plasma::Svg&)
/home/Sathyajith/Plasmoids/plasma-wifi-0.3/plasma-wifi-signal.cpp:116: error: ‘class Plasma::Svg’ has no member named ‘setContentType’
/home/Sathyajith/Plasmoids/plasma-wifi-0.3/plasma-wifi-signal.cpp:116: error: ‘SingleImage’ is not a member of ‘Plasma::Svg’
/home/Sathyajith/Plasmoids/plasma-wifi-0.3/plasma-wifi-signal.cpp:117: error: ‘contentSize’ was not declared in this scope
/home/Sathyajith/Plasmoids/plasma-wifi-0.3/plasma-wifi-signal.cpp:119: error: ‘class Plasma::Svg’ has no member named ‘elementExists’
/home/Sathyajith/Plasmoids/plasma-wifi-0.3/plasma-wifi-signal.cpp:147: error: ‘class Plasma::Svg’ has no member named ‘elementExists’
/home/Sathyajith/Plasmoids/plasma-wifi-0.3/plasma-wifi-signal.cpp: In member function ‘QSizeF Plasma_WiFi_Signal_Strength::contentSizeHint() const’:
/home/Sathyajith/Plasmoids/plasma-wifi-0.3/plasma-wifi-signal.cpp:216: error: ‘contentSize’ was not declared in this scope
make[2]: *** [CMakeFiles/plasma_applet_wifi_signal.dir/plasma-wifi-signal.o] Error 1
make[1]: *** [CMakeFiles/plasma_applet_wifi_signal.dir/all] Error 2
make: *** [all] Error 2


- Dec 09 2008
AmarokPidgin

Amarok 1.x Scripts by keegancsmith 150 comments

Well I've downloaded Gaim beta6, installed dbus-python from the link given in above comments, ran the configure script as ./configure --enable-dbus and still I'm not able to get the dbus support compiled ingaim as a result of which I can't run this script. WHat should I do/which package shoud I install so that I can get this script running? thanks
sathya

oh btw I'm using openSuSE 10.2 - Apr 20 2007