Image 01
profile-image

DenisBY

Denis Kot Minsk, Belarus
Plasma WiFi

Plasma 4 Extensions by ochoha 52 comments

# make
Generating plasma-wifi-signal.moc
Scanning dependencies of target plasma_applet_wifi_signal
[ 50%] Building CXX object CMakeFiles/plasma_applet_wifi_signal.dir/plasma_applet_wifi_signal_automoc.o
[100%] Building CXX object CMakeFiles/plasma_applet_wifi_signal.dir/plasma-wifi-signal.o
/usr/src/plasmoids/plasma-wifi-0.3/plasma-wifi-signal.cpp: In constructor ‘Plasma_WiFi_Signal_Strength::Plasma_WiFi_Signal_Strength(QObject*, const QVariantList&)’:
/usr/src/plasmoids/plasma-wifi-0.3/plasma-wifi-signal.cpp:37: error: ‘setDrawStandardBackground’ was not declared in this scope
/usr/src/plasmoids/plasma-wifi-0.3/plasma-wifi-signal.cpp: In member function ‘virtual void Plasma_WiFi_Signal_Strength::init()’:
/usr/src/plasmoids/plasma-wifi-0.3/plasma-wifi-signal.cpp:57: error: ‘self’ is not a member of ‘Plasma::Theme’
/usr/src/plasmoids/plasma-wifi-0.3/plasma-wifi-signal.cpp:58: error: ‘self’ is not a member of ‘Plasma::Theme’
/usr/src/plasmoids/plasma-wifi-0.3/plasma-wifi-signal.cpp: In member function ‘void Plasma_WiFi_Signal_Strength::paintAntenna(QPainter*, const QRect&)’:
/usr/src/plasmoids/plasma-wifi-0.3/plasma-wifi-signal.cpp:115: error: no matching function for call to ‘Plasma::Svg::Svg(QString&, Plasma_WiFi_Signal_Strength* const)’
/usr/kde/4.1/include/plasma/svg.h:73: note: candidates are: Plasma::Svg::Svg(QObject*)
/usr/kde/4.1/include/plasma/svg.h:51: note: Plasma::Svg::Svg(const Plasma::Svg&)
/usr/src/plasmoids/plasma-wifi-0.3/plasma-wifi-signal.cpp:116: error: ‘class Plasma::Svg’ has no member named ‘setContentType’
/usr/src/plasmoids/plasma-wifi-0.3/plasma-wifi-signal.cpp:116: error: ‘SingleImage’ is not a member of ‘Plasma::Svg’
/usr/src/plasmoids/plasma-wifi-0.3/plasma-wifi-signal.cpp:117: error: ‘contentSize’ was not declared in this scope
/usr/src/plasmoids/plasma-wifi-0.3/plasma-wifi-signal.cpp:119: error: ‘class Plasma::Svg’ has no member named ‘elementExists’
/usr/src/plasmoids/plasma-wifi-0.3/plasma-wifi-signal.cpp:147: error: ‘class Plasma::Svg’ has no member named ‘elementExists’
/usr/src/plasmoids/plasma-wifi-0.3/plasma-wifi-signal.cpp: In member function ‘QSizeF Plasma_WiFi_Signal_Strength::contentSizeHint() const’:
/usr/src/plasmoids/plasma-wifi-0.3/plasma-wifi-signal.cpp:216: error: ‘contentSize’ was not declared in this scope
make[2]: *** [CMakeFiles/plasma_applet_wifi_signal.dir/plasma-wifi-signal.o] Error 1
make[1]: *** [CMakeFiles/plasma_applet_wifi_signal.dir/all] Error 2
make: *** [all] Error 2

kde-4.0.85 - Jul 08 2008