Image 01
profile-image

glepore70

Greg Lepore
test
QuoteSee Stock/Currency plasmoid

Plasma 4 Extensions 53 comments

Score 50.0%
Oct 12 2009
I'm trying to change the width of the widget, due to the text overlapping on some stocks, however, after changing the lines as you specify earlier in the comments, and re-installing, the width doesn't change at all. What am I doing wrong? Changing as below doesn't work. Thanks,

You can change the size in source files.

src/quotesee.cpp:84, 85
setMinimumSize(270, 100);
setPreferredSize(270, 100);

these two lines set the minimum and prefered size for the widget, first parameter is minimum width, second minimum height, parameters need to be integer type

src/quote.ccp:43
setMinimumWidth(270);

sets the minimum width for the stock item, takes integer parameter. - Nov 26 2010
Kate Tab Bar Extension

Text Editors 31 comments

Score 50.0%
Dec 02 2005
I compiled and installed on Kubuntu Edgy, and the tab bar appears on the bottom of the screen, but there is no corresponding entry in Settings->Configure Kate->plugins. Is there another method for accession the configuration settings? - Sep 30 2006
KGtk (Use KDE Dialogs in Gtk Apps)

Various KDE 1.-4. Improvements 453 comments

Score 76.7%
Nov 03 2011
kgtk.c: In function 'gtk_file_chooser_button_new':
kgtk.c:1322: error: 'GtkWidget' undeclared (first use in this function)
kgtk.c:1329: error: 'GtkFileChooserButtonPrivate' undeclared (first use in this function)
kgtk.c:1329: error: 'priv' undeclared (first use in this function)
kgtk.c:1331: error: 'title' undeclared (first use in this function)
kgtk.c:1331: error: 'action' undeclared (first use in this function)
kgtk.c:1332: error: invalid type argument of '->'
kgtk.c:1336: warning: implicit declaration of function 'g_signal_handlers_disconnect_matched'
kgtk.c:1337: error: 'G_SIGNAL_MATCH_DATA' undeclared (first use in this function)
kgtk.c:1339: warning: implicit declaration of function 'g_signal_connect'
kgtk.c:1340: warning: implicit declaration of function 'G_CALLBACK'
kgtk.c: At top level:
kgtk.c:1356: warning: 'struct PR_LoadLibrary' declared inside parameter list
kgtk.c:1356: warning: its scope is only this definition or declaration, which is probably not what you want
kgtk.c:1357: warning: no previous prototype for 'PR_FindFunctionSymbol'
make[2]: *** [kgtk.lo] Error 1
make[2]: Leaving directory `/home/knoppix/Desktop/kgtk-0.3/gtk'
make[1]: *** [all-recursive] Error 1
make[1]: Leaving directory `/home/knoppix/Desktop/kgtk-0.3' - Mar 17 2006