Image 01
profile-image

hughnicks

hugh hugh
M4v3r1ck Monitor Tool

Karamba & Superkaramba by M4v3r1ckrj 27 comments

this worked fo rme right off the bat, but i can't seem to make the background trans like you have it in the screen shot. is there something i need to modify, or do i need to change the background pic all together?

thanks! - Feb 29 2004
SuperKaramba

Karamba & Superkaramba by ageitgey 326 comments

this is getting more and more frustrating.
how can this not work on a new install of fbsd 5.1 and kde 3.1.3? is it not supposed to? does it only work with gnome?
how can i not have python installed correctly when pkg_info tells me it is?

why does the config file complain about stuff that i don't have installed? what extra stuff do i need to install after a new fbsd installation???

once again;

# cd superkaramba-0.31/
# ./configure
checking build system type... i386-unknown-freebsd5.1
checking host system type... i386-unknown-freebsd5.1
checking target system type... i386-unknown-freebsd5.1
checking for a BSD-compatible install... /usr/bin/install -c
checking for -p flag to install... yes
checking whether build environment is sane... yes
checking for gawk... no
checking for mawk... no
checking for nawk... nawk
checking whether make sets $(MAKE)... yes
checking for style of include used by make... GNU
checking for gcc... gcc
checking for C compiler default output... a.out
checking whether the C compiler works... yes
checking whether we are cross compiling... no
checking for suffix of executables...
checking for suffix of object files... o
checking whether we are using the GNU C compiler... yes
checking whether gcc accepts -g... yes
checking for gcc option to accept ANSI C... none needed
checking dependency style of gcc... gcc3
checking how to run the C preprocessor... gcc -E
checking for g++... g++
checking whether we are using the GNU C++ compiler... yes
checking whether g++ accepts -g... yes
checking dependency style of g++... gcc3
checking whether g++ supports -Wundef... yes
checking whether g++ supports -Wno-long-long... yes
checking whether g++ supports -Wnon-virtual-dtor... yes
checking whether g++ supports -fno-exceptions... yes
checking whether g++ supports -fno-check-new... yes
checking whether g++ supports -fexceptions... yes
checking how to run the C++ preprocessor... g++ -E
checking whether g++ supports -frepo... yes
not using lib directory suffix
checking for ld used by GCC... /usr/bin/ld
checking if the linker (/usr/bin/ld) is GNU ld... yes
checking for /usr/bin/ld option to reload object files... -r
checking for BSD-compatible nm... /usr/bin/nm -B
checking for a sed that does not truncate output...
checking whether ln -s works... yes
checking how to recognise dependant libraries... pass_all
checking for egrep... grep -E
checking for ANSI C header files... yes
checking for sys/types.h... yes
checking for sys/stat.h... yes
checking for stdlib.h... yes
checking for string.h... yes
checking for memory.h... yes
checking for strings.h... yes
checking for inttypes.h... yes
checking for stdint.h... yes
checking for unistd.h... yes
checking dlfcn.h usability... yes
checking dlfcn.h presence... yes
checking for dlfcn.h... yes
checking the maximum length of command line arguments... 16384
checking command to parse /usr/bin/nm -B output from gcc object... ok
checking for objdir... .libs
checking for ranlib... ranlib
checking for strip... strip
checking if gcc static flag works... yes
checking if gcc supports -fno-rtti -fno-exceptions... yes
checking for gcc option to produce PIC... -fPIC
checking if gcc PIC flag -fPIC works... yes
checking if gcc supports -c -o file.o... yes
checking whether the gcc linker (/usr/bin/ld) supports shared libraries... yes
checking whether -lc should be explicitly linked in... yes
checking how to hardcode library paths into programs... immediate
checking whether stripping libraries is possible... yes
checking dynamic linker characteristics... freebsd5.1 ld.so
checking if libtool supports shared libraries... yes
checking whether to build shared libraries... yes
checking whether to build static libraries... no
configure: creating libtool
appending configuration tag "CXX" to libtool
checking whether the g++ linker (/usr/bin/ld) supports shared libraries... yes
checking for g++ option to produce PIC... -fPIC
checking if g++ PIC flag -fPIC works... yes
checking if g++ supports -c -o file.o... yes
checking whether the g++ linker (/usr/bin/ld) supports shared libraries... yes
checking whether -lc should be explicitly linked in... yes
checking how to hardcode library paths into programs... immediate
checking whether stripping libraries is possible... yes
checking dynamic linker characteristics... freebsd5.1 ld.so
appending configuration tag "GCJ" to libtool
checking if gcj supports -fno-rtti -fno-exceptions... (cached) yes
checking for gcj option to produce PIC... -fPIC
checking if gcj PIC flag -fPIC works... no
checking if gcj supports -c -o file.o... no
checking whether the gcj linker (/usr/bin/ld) supports shared libraries... yes
checking whether -lc should be explicitly linked in... yes
checking how to hardcode library paths into programs... immediate
checking whether stripping libraries is possible... yes
checking dynamic linker characteristics... freebsd5.1 ld.so
checking for msgfmt... /usr/local/bin/msgfmt
checking for gmsgfmt... /usr/local/bin/msgfmt
checking for xgettext... /usr/local/bin/xgettext
checking for main in -lutil... yes
checking for main in -lcompat... yes
checking for crypt in -lcrypt... yes
checking for socklen_t... socklen_t
checking for dnet_ntoa in -ldnet... no
checking for dnet_ntoa in -ldnet_stub... no
checking for inet_ntoa... yes
checking for connect... yes
checking for remove... yes
checking for shmat... yes
checking crt_externs.h usability... no
checking crt_externs.h presence... no
checking for crt_externs.h... no
checking for _NSGetEnviron... no
checking for sys/types.h... (cached) yes
checking for stdint.h... (cached) yes
checking for poll in -lpoll... no
checking CoreAudio/CoreAudio.h usability... no
checking CoreAudio/CoreAudio.h presence... no
checking for CoreAudio/CoreAudio.h... no
checking for res_init... no
checking if res_init needs custom prototype... res_init unavailable
checking for killpg in -lucb... no
checking for int... yes
checking size of int... 4
checking for long... yes
checking size of long... 4
checking for char *... yes
checking size of char *... 4
checking for char... yes
checking size of char... 1
checking for dlopen in -ldl... no
checking for shl_unload in -ldld... no
checking for vsnprintf... yes
checking for snprintf... yes
checking for X... libraries /usr/X11R6/lib, headers /usr/X11R6/include
checking for IceConnectionNumber in -lICE... yes
checking for libXext... yes
checking for Xinerama... no
checking for pthread_create in -lpthread... no
checking whether g++ supports -pthread... yes
checking for extra includes... no
checking for extra libs... no
checking for libz... -lz
checking for libpng... no
checking for libjpeg6b... no
checking for libjpeg... no
configure: WARNING:
There is an installation error in jpeg support. You seem to have only one
of either the headers _or_ the libraries installed. You may need to either
provide correct --with-extra-... options, or the development package of
libjpeg6b. You can get a source package of libjpeg from http://www.ijg.org/
Disabling JPEG support.

checking for Qt... libraries /usr/X11R6/lib, headers /usr/X11R6/include using -mt
checking if Qt compiles without flags... yes
checking for moc... /usr/X11R6/bin/moc
checking for uic... /usr/X11R6/bin/uic
checking whether uic supports -L ... yes
checking whether uic supports -nounload ... yes
checking if Qt needs ... sed: first RE may not be empty
yes
checking for rpath... yes
checking for KDE... libraries /usr/local/lib, headers /usr/local/include
checking for KDE paths... defaults
checking for dcopidl... /usr/local/bin/dcopidl
checking for dcopidl2cpp... /usr/local/bin/dcopidl2cpp
checking for mcopidl... /usr/local/bin/mcopidl
checking for artsc-config... /usr/local/bin/artsc-config
checking for kde-config... /usr/local/bin/kde-config
checking for meinproc... /usr/local/bin/meinproc
checking whether byte ordering is bigendian... no
checking for MAXPATHLEN... 1024
checking for Python directory... /usr/local
checking for Python2.2... header no library no modules no
checking for Python2.1... header no library no modules no
checking for Python2.0... header no library no modules no
checking for Python1.5... header no library no modules no
checking for libxmms... xmms-config: not found
xmms-config: not found
no
checking if doc should be compiled... yes
checking if po should be compiled... yes
checking if src should be compiled... yes
configure: creating ./config.status
fast creating Makefile
fast creating doc/Makefile
fast creating doc/en/Makefile
fast creating po/Makefile
fast creating src/Makefile
config.status: creating config.h
config.status: config.h is unchanged
config.status: executing depfiles commands

Good - your configure finished. Start make now

why doesn't it say somewhere (anywhere), about other files you might need to install this? why wouldn't i have jpeg support built in. what do i need?

thank you. - Sep 03 2003
SuperKaramba

Karamba & Superkaramba by ageitgey 326 comments

that's the weird part. i do have python installed:

python-2.3_1 An interpreted object-oriented programming language

i can't see this being a kde prob, because it's meant to run on kde.

this is a new box. just set up yesterday. cvsupit and portupgrade are done. everything is up to date. how can python not be installed properly?

any help would be great, as i would like to get this to work. - Sep 03 2003
SuperKaramba

Karamba & Superkaramba by ageitgey 326 comments

i'm running kde 3.1.3 on freebsd 5.1, and evertime i try to install sk, the configuration file works ok, but then during the compile, i get this:

-c -o main.o `test -f 'main.cpp' || echo './'`main.cpp; \
then mv ".deps/main.Tpo" ".deps/main.Po"; \
else rm -f ".deps/main.Tpo"; exit 1; \
fi
In file included from main.cpp:19:
karamba.h:12:20: Python.h: No such file or directory
In file included from main.cpp:19:
karamba.h:185: syntax error before `*' token
main.cpp:35: syntax error before `*' token
main.cpp: In function `int main(int, char**)':
main.cpp:77: `Py_Initialize' undeclared (first use this function)
main.cpp:77: (Each undeclared identifier is reported only once for each
function it appears in.)
main.cpp:80: `PyEval_InitThreads' undeclared (first use this function)
main.cpp:82: `mainThreadState' undeclared (first use this function)
main.cpp:85: `PyThreadState_Get' undeclared (first use this function)
main.cpp:88: `PyEval_ReleaseLock' undeclared (first use this function)
main.cpp:118: `PyInterpreterState' undeclared (first use this function)
main.cpp:118: `mainInterpreterState' undeclared (first use this function)
main.cpp:120: `PyThreadState' undeclared (first use this function)
main.cpp:120: `myThreadState' undeclared (first use this function)
main.cpp:120: `PyThreadState_New' undeclared (first use this function)
main.cpp:121: `PyThreadState_Swap' undeclared (first use this function)
main.cpp:122: `PyEval_AcquireLock' undeclared (first use this function)
main.cpp:123: `Py_Finalize' undeclared (first use this function)
gmake[2]: *** [main.o] Error 1
gmake[2]: Leaving directory `/usr/local/superkaramba-0.31/src'
gmake[1]: *** [install-recursive] Error 1
gmake[1]: Leaving directory `/usr/local/superkaramba-0.31/src'
gmake: *** [install-recursive] Error 1

does anyone have an idea of what could be wrong?

thanks. - Aug 27 2003