Image 01
profile-image

kotyz

Jakub Sen , Czech Republic
Polyester

KDE 3.5 Themes by mart 395 comments

Oh, and I use gcc/g++ 4.3.0, could be the problem in this? I heard this version is buggy ... - Mar 28 2008
Polyester

KDE 3.5 Themes by mart 395 comments

I tried to compile polyester from version 1.0.2 to 1.0.4 and I allways get this error:


polyester.cc: In member function 'virtual void polyester::polyesterButton::drawButton(QPainter*)':
polyester.cc:480: error: 'abs' was not declared in this scope
polyester.cc:486: error: 'abs' was not declared in this scope
polyester.cc:501: warning: conversion to 'float' from 'double' may alter its value
polyester.cc:502: warning: conversion to 'float' from 'double' may alter its value
polyester.cc:503: warning: conversion to 'float' from 'double' may alter its value
polyester.cc:504: warning: conversion to 'float' from 'double' may alter its value
polyester.cc:513: warning: conversion to 'float' from 'double' may alter its value
polyester.cc:514: warning: conversion to 'float' from 'double' may alter its value
polyester.cc:515: warning: conversion to 'float' from 'double' may alter its value
polyester.cc:516: warning: conversion to 'float' from 'double' may alter its value
polyester.cc:520: warning: conversion to 'float' from 'double' may alter its value
polyester.cc:521: warning: conversion to 'float' from 'double' may alter its value
polyester.cc:522: warning: conversion to 'float' from 'double' may alter its value
polyester.cc:523: warning: conversion to 'float' from 'double' may alter its value
polyester.cc:527: warning: conversion to 'float' from 'double' may alter its value
polyester.cc:528: warning: conversion to 'float' from 'double' may alter its value
polyester.cc:529: warning: conversion to 'float' from 'double' may alter its value
polyester.cc:530: warning: conversion to 'float' from 'double' may alter its value
polyester.cc:534: warning: conversion to 'float' from 'double' may alter its value
polyester.cc:535: warning: conversion to 'float' from 'double' may alter its value
polyester.cc:536: warning: conversion to 'float' from 'double' may alter its value
polyester.cc:537: warning: conversion to 'float' from 'double' may alter its value
polyester.cc:542: warning: conversion to 'float' from 'double' may alter its value
polyester.cc:546: warning: conversion to 'float' from 'double' may alter its value
polyester.cc: At global scope:
polyester.cc:1421: warning: unused parameter 'e'
make[3]: *** [polyester.lo] Error 1
make[3]: Leaving directory `/home/kotyz/builds/kdestyles/polyester/src/polyester-1.0.4/client'
make[2]: *** [all-recursive] Error 1
make[2]: Leaving directory `/home/kotyz/builds/kdestyles/polyester/src/polyester-1.0.4/client'
make[1]: *** [all-recursive] Error 1
make[1]: Leaving directory `/home/kotyz/builds/kdestyles/polyester/src/polyester-1.0.4'
make: *** [all] Error 2

Any ideas what's wrong? - Mar 28 2008
kooldock

Various KDE 1.-4. Improvements by bisiek 227 comments

I prepared czech localization file for kooldock. It is available for download here:
http://disk.jabbim.cz/kotyz@jabber.cz/kooldock-cs.po.tar.gz

Please try it and add it in the next release version of kooldock. - Sep 15 2007
kooldock

Various KDE 1.-4. Improvements by bisiek 227 comments

Yes, it works fine now. And the zooming effects in svn version looks better than the previous version. - Sep 05 2007
kooldock

Various KDE 1.-4. Improvements by bisiek 227 comments

And the file 'dinfo.h' is really missing, I looked for it in the /src directory but didn't found it. - Sep 02 2007
kooldock

Various KDE 1.-4. Improvements by bisiek 227 comments

When I try to compile the cooldock-svn I get error messages about missing file 'dinfo.h'

In file included from kooldock.cpp:56:
kooldock.h:46:19: error: dinfo.h: není souborem ani adresářem
In file included from kooldock.cpp:56:
kooldock.h:231: error: ‘dInfo’ was not declared in this scope
kooldock.h:231: error: template argument 1 is invalid
kooldock.cpp: In member function ‘void KoolDock::run(QString)’:
kooldock.cpp:1439: warning: taking address of temporary
kooldock.cpp:1439: warning: taking address of temporary
kooldock.cpp: In member function ‘void KoolDock::addWindows()’:
kooldock.cpp:1505: error: request for member ‘clear’ in ‘((KoolDock*)this)->KoolDock::desks’, which is of non-class type ‘int’
kooldock.cpp:1511: error: request for member ‘append’ in ‘((KoolDock*)this)->KoolDock::desks’, which is of non-class type ‘int’
kooldock.cpp:1511: error: expected type-specifier before ‘dInfo’
kooldock.cpp:1511: error: expected `)' before ‘dInfo’
kooldock.cpp: In member function ‘void KoolDock::init1()’:
kooldock.cpp:3254: error: request for member ‘setAutoDelete’ in ‘((KoolDock*)this)->KoolDock::desks’, which is of non-class type ‘int’
kooldock.cpp: At global scope:
kooldock.cpp:3654: warning: unused parameter ‘id’
kooldock.cpp: In member function ‘void KoolDock::updTaskList()’:
kooldock.cpp:3700: error: request for member ‘setAutoDelete’ in ‘((KoolDock*)this)->KoolDock::desks’, which is of non-class type ‘int’
kooldock.cpp:3704: error: request for member ‘clear’ in ‘((KoolDock*)this)->KoolDock::desks’, which is of non-class type ‘int’
kooldock.cpp:3708: error: request for member ‘append’ in ‘((KoolDock*)this)->KoolDock::desks’, which is of non-class type ‘int’
kooldock.cpp:3708: error: expected type-specifier before ‘dInfo’
kooldock.cpp:3708: error: expected `)' before ‘dInfo’
kooldock.cpp:3719: error: request for member ‘at’ in ‘((KoolDock*)this)->KoolDock::desks’, which is of non-class type ‘int’
kooldock.cpp:3721: error: request for member ‘current’ in ‘((KoolDock*)this)->KoolDock::desks’, which is of non-class type ‘int’
kooldock.cpp:3723: error: request for member ‘current’ in ‘((KoolDock*)this)->KoolDock::desks’, which is of non-class type ‘int’
kooldock.cpp:3725: error: request for member ‘current’ in ‘((KoolDock*)this)->KoolDock::desks’, which is of non-class type ‘int’
kooldock.cpp:3728: error: request for member ‘current’ in ‘((KoolDock*)this)->KoolDock::desks’, which is of non-class type ‘int’
kooldock.cpp:3732: error: request for member ‘at’ in ‘((KoolDock*)this)->KoolDock::desks’, which is of non-class type ‘int’
kooldock.cpp: In member function ‘void KoolDock::addToTaskList(WId)’:
kooldock.cpp:3751: error: request for member ‘at’ in ‘((KoolDock*)this)->KoolDock::desks’, which is of non-class type ‘int’
kooldock.cpp:3753: error: request for member ‘at’ in ‘((KoolDock*)this)->KoolDock::desks’, which is of non-class type ‘int’
kooldock.cpp:3755: error: request for member ‘at’ in ‘((KoolDock*)this)->KoolDock::desks’, which is of non-class type ‘int’
kooldock.cpp:3757: error: request for member ‘at’ in ‘((KoolDock*)this)->KoolDock::desks’, which is of non-class type ‘int’
kooldock.cpp:3768: error: request for member ‘at’ in ‘((KoolDock*)this)->KoolDock::desks’, which is of non-class type ‘int’
kooldock.cpp:3772: error: request for member ‘at’ in ‘((KoolDock*)this)->KoolDock::desks’, which is of non-class type ‘int’
kooldock.cpp: In member function ‘void KoolDock::rmFromTaskList(WId)’:
kooldock.cpp:3784: warning: comparison between signed and unsigned integer expressions
kooldock.cpp:3790: error: request for member ‘at’ in ‘((KoolDock*)this)->KoolDock::desks’, which is of non-class type ‘int’
kooldock.cpp:3790: error: request for member ‘at’ in ‘((KoolDock*)this)->KoolDock::desks’, which is of non-class type ‘int’
kooldock.cpp:3792: error: request for member ‘at’ in ‘((KoolDock*)this)->KoolDock::desks’, which is of non-class type ‘int’
kooldock.cpp:3797: error: request for member ‘at’ in ‘((KoolDock*)this)->KoolDock::desks’, which is of non-class type ‘int’
kooldock.cpp:3803: error: request for member ‘at’ in ‘((KoolDock*)this)->KoolDock::desks’, which is of non-class type ‘int’
make[2]: *** [kooldock.o] Error 1
make[2]: Leaving directory `/home/kotyz/test/kooldock/src'
make[1]: *** [all-recursive] Error 1
make[1]: Leaving directory `/home/kotyz/test/kooldock'
make: *** [all] Error 2


>>kooldock.h:46:19: error: dinfo.h: není souborem ani adresářem (= dinfo.h: not file or directory) - Sep 02 2007