Image 01
profile-image

lestek

lestek none , Poland
Plasma Feed

Plasma 4 Extensions by matthiasFauconneau 22 comments

After "make install" i get following errors:

lestek@laptop:~/Dokumenty/instalki/118140-plasma-feed/build$ sudo make install
Generating moc_plasma-feed.cpp
[100%] Built target plasma_applet_feed_automoc
[100%] Building CXX object CMakeFiles/plasma_applet_feed.dir/plasma_applet_feed_automoc.o
[100%] Building CXX object CMakeFiles/plasma_applet_feed.dir/plasma-feed.o
/home/lestek/Dokumenty/instalki/118140-plasma-feed/plasma-feed.cpp: In member function ‘void PlasmaFeed::updateIcon()’:
/home/lestek/Dokumenty/instalki/118140-plasma-feed/plasma-feed.cpp:149: error: ‘fromTheme’ is not a member of ‘QIcon’
/home/lestek/Dokumenty/instalki/118140-plasma-feed/plasma-feed.cpp:151: error: ‘fromTheme’ is not a member of ‘QIcon’
make[2]: *** [CMakeFiles/plasma_applet_feed.dir/plasma-feed.o] Error 1
make[1]: *** [CMakeFiles/plasma_applet_feed.dir/all] Error 2
make: *** [all] Error 2

(Kubuntu Karmic 9.10 x64, KDE 4.3.4) - Jan 07 2010
PWikipedia

Plasma 4 Extensions by giacomololo 6 comments

Thanks!
BTW: Can you add option for choosing background or text color? (in Oxygen theme plasmoid has black text on black background and some words are unreadable) - Nov 27 2009
toplike

Plasma 4 Extensions by AlexeyTyapkin 27 comments

I'm using x86_64 linux, Karrmic Koala 9.10, kde 4.3.2.

Now, after adding that code, make gives following output:

[ 50%] Built target plasma_engine_top_like_automoc
Linking CXX shared module ../lib/plasma_engine_top_like.so
/usr/bin/ld: /usr/lib/gcc/x86_64-linux-gnu/4.4.1/../../../../lib/libproc.a(readproc.o): relocation R_X86_64_32S against `.rodata' can not be used when making a shared object; recompile with -fPIC
/usr/lib/gcc/x86_64-linux-gnu/4.4.1/../../../../lib/libproc.a: could not read symbols: Bad value
collect2: ld returned 1 exit status
make[2]: *** [lib/plasma_engine_top_like.so] Error 1
make[1]: *** [data_engine/CMakeFiles/plasma_engine_top_like.dir/all] Error 2
make: *** [all] Error 2 - Oct 27 2009
toplike

Plasma 4 Extensions by AlexeyTyapkin 27 comments

...
[100%] Building CXX object data_engine/CMakeFiles/plasma_engine_top_like.dir/top_like.o
In file included from /usr/include/c++/4.4/ext/hash_map:59,
from /home/lestek/Dokumenty/instalki/toplike/data_engine/top_like.h:10,
from /home/lestek/Dokumenty/instalki/toplike/data_engine/top_like.cpp:1:
/usr/include/c++/4.4/backward/backward_warning.h:28:2: warning: #warning This file includes at least one deprecated or antiquated header which may be removed without further notice at a future date. Please use a non-deprecated interface with equivalent functionality instead. For a listing of replacement headers and interfaces, consult the file backward_warning.h. To disable this warning use -Wno-deprecated.
Linking CXX shared module ../lib/plasma_engine_top_like.so
/usr/bin/ld: /usr/lib/gcc/x86_64-linux-gnu/4.4.1/../../../../lib/libproc.a(readproc.o): relocation R_X86_64_32S against `.rodata' can not be used when making a shared object; recompile with -fPIC
/usr/lib/gcc/x86_64-linux-gnu/4.4.1/../../../../lib/libproc.a: could not read symbols: Bad value
collect2: ld returned 1 exit status
make[2]: *** [lib/plasma_engine_top_like.so] Error 1
make[1]: *** [data_engine/CMakeFiles/plasma_engine_top_like.dir/all] Error 2
make: *** [all] Error 2 - Oct 27 2009
Kwooty

Network by kwooty 75 comments

Everything OK now. Thanks! - Oct 27 2009
Kwooty

Network by kwooty 75 comments

It's my output of 'make' command (Karmic Koala 9.10, KDE 4.3.2):

...
[ 15%] Building CXX object src/CMakeFiles/kwooty.dir/kwooty_automoc.o
In file included from /home/lestek/Dokumenty/instalki/kwooty/build/src/kwooty_automoc.cpp:4:
/home/lestek/Dokumenty/instalki/kwooty/build/src/moc_itemdownloadupdater.cpp: In member function ‘virtual int ItemDownloadUpdater::qt_metacall(QMetaObject::Call, int, void**)’:
/home/lestek/Dokumenty/instalki/kwooty/build/src/moc_itemdownloadupdater.cpp:73: error: invalid use of incomplete type ‘struct NzbFileData’
/home/lestek/Dokumenty/instalki/kwooty/build/src/../../src/itemdownloadupdater.h:32: error: forward declaration of ‘struct NzbFileData’
/home/lestek/Dokumenty/instalki/kwooty/build/src/moc_itemdownloadupdater.cpp:73: error: initializing argument 1 of ‘void ItemDownloadUpdater::decodeSegmentsSignal(NzbFileData)’
In file included from /home/lestek/Dokumenty/instalki/kwooty/build/src/kwooty_automoc.cpp:4:
/home/lestek/Dokumenty/instalki/kwooty/build/src/moc_itemdownloadupdater.cpp: In member function ‘void ItemDownloadUpdater::decodeSegmentsSignal(NzbFileData)’:
/home/lestek/Dokumenty/instalki/kwooty/build/src/moc_itemdownloadupdater.cpp:95: error: ‘_t1’ has incomplete type
/home/lestek/Dokumenty/instalki/kwooty/build/src/../../src/itemdownloadupdater.h:32: error: forward declaration of ‘struct NzbFileData’
make[2]: *** [src/CMakeFiles/kwooty.dir/kwooty_automoc.o] Error 1
make[1]: *** [src/CMakeFiles/kwooty.dir/all] Error 2
make: *** [all] Error 2 - Oct 27 2009
ComicBook Thumbnail Plugin

Various KDE 1.-4. Improvements by qwertymaniac 25 comments

Sorry, i've forgot to enable preview for "Comic Book files" in Dolphin configuration.
Besides my testing .cbr file was too large - preview works after changing "Maximum file size" in preview configuration.

So, everything realy works. Thanks again! - Oct 25 2009
ComicBook Thumbnail Plugin

Various KDE 1.-4. Improvements by qwertymaniac 25 comments

Install works, but there is no previewing.
The same afer redownloadnig Your file. - Oct 25 2009
ComicBook Thumbnail Plugin

Various KDE 1.-4. Improvements by qwertymaniac 25 comments

Thanks,
I've added this two lines to CMakeList.txt:

add_definitions (${QT_DEFINITIONS} ${KDE4_DEFINITIONS})
include_directories (${CMAKE_SOURCE_DIR} ${CMAKE_BINARY_DIR} ${KDE4_INCLUDES})

and now everything works! - Oct 25 2009
ComicBook Thumbnail Plugin

Various KDE 1.-4. Improvements by qwertymaniac 25 comments

I have following error after make:
lestek@laptop:~/tmp/comicbook-thumbnails/build$ make
Scanning dependencies of target comicbookthumbnail_automoc
Generating comiccreator.moc
[ 0%] Built target comicbookthumbnail_automoc
Scanning dependencies of target comicbookthumbnail
[ 50%] Building CXX object CMakeFiles/comicbookthumbnail.dir/comicbookthumbnail_automoc.o
[100%] Building CXX object CMakeFiles/comicbookthumbnail.dir/comiccreator.o
In file included from /usr/include/kio/kio_export.h:24,
from /usr/include/kio/thumbcreator.h:23,
from /home/lestek/tmp/comicbook-thumbnails/comiccreator.h:23,
from /home/lestek/tmp/comicbook-thumbnails/comiccreator.cpp:20:
/usr/include/kdemacros.h:162:29: error: QtCore/qglobal.h: No such file or directory
In file included from /home/lestek/tmp/comicbook-thumbnails/comiccreator.cpp:20:
/home/lestek/tmp/comicbook-thumbnails/comiccreator.h:25:29: error: QtCore/QByteArray: No such file or directory
/home/lestek/tmp/comicbook-thumbnails/comiccreator.h:26:29: error: QtCore/QEventLoop: No such file or directory
/home/lestek/tmp/comicbook-thumbnails/comiccreator.h:27:27: error: QtCore/QProcess: No such file or directory
/home/lestek/tmp/comicbook-thumbnails/comiccreator.h:28:30: error: QtCore/QStringList: No such file or directory
In file included from /usr/include/kzip.h:21,
from /home/lestek/tmp/comicbook-thumbnails/comiccreator.cpp:23:
/usr/include/karchive.h:27:24: error: QtCore/QDate: No such file or directory
/usr/include/karchive.h:28:26: error: QtCore/QString: No such file or directory
/usr/include/karchive.h:30:24: error: QtCore/QHash: No such file or directory
In file included from /home/lestek/tmp/comicbook-thumbnails/comiccreator.cpp:24:
/usr/include/kmimetype.h:24:24: error: QtCore/QList: No such file or directory
In file included from /usr/include/kmimetype.h:26,
from /home/lestek/tmp/comicbook-thumbnails/comiccreator.cpp:24:
/usr/include/kurl.h:27:27: error: QtCore/QVariant: No such file or directory
/usr/include/kurl.h:28:23: error: QtCore/QUrl: No such file or directory
/usr/include/kurl.h:29:23: error: QtCore/QMap: No such file or directory
In file included from /usr/include/ksycocaentry.h:22,
from /usr/include/kservicetype.h:24,
from /usr/include/kmimetype.h:28,
from /home/lestek/tmp/comicbook-thumbnails/comiccreator.cpp:24:
/usr/include/kglobal.h:23:33: error: QtCore/QAtomicPointer: No such file or directory
In file included from /usr/include/ksycocaentry.h:24,
from /usr/include/kservicetype.h:24,
from /usr/include/kmimetype.h:28,
from /home/lestek/tmp/comicbook-thumbnails/comiccreator.cpp:24:
/usr/include/ksharedptr.h:30:47: error: QtCore/QExplicitlySharedDataPointer: No such file or directory
In file included from /usr/include/kservicetype.h:24,
from /usr/include/kmimetype.h:28,
from /home/lestek/tmp/comicbook-thumbnails/comiccreator.cpp:24:
/usr/include/ksycocaentry.h:26:30: error: QtCore/QDataStream: No such file or directory
In file included from /usr/include/kconfig.h:27,
from /usr/include/kservicetype.h:31,
from /usr/include/kmimetype.h:28,
from /home/lestek/tmp/comicbook-thumbnails/comiccreator.cpp:24:
/usr/include/kconfigbase.h:29:27: error: QtCore/QtGlobal: No such file or directory
In file included from /home/lestek/tmp/comicbook-thumbnails/comiccreator.cpp:25:
/usr/include/kdebug.h:27:25: error: QtCore/QDebug: No such file or directory
/home/lestek/tmp/comicbook-thumbnails/comiccreator.cpp:33:24: error: QtGui/QImage: No such file or directory
/home/lestek/tmp/comicbook-thumbnails/comiccreator.cpp:34:24: error: QtCore/QFile: No such file or directory
/home/lestek/tmp/comicbook-thumbnails/comiccreator.cpp:35:28: error: QtCore/QFileInfo: No such file or directory
In file included from /home/lestek/tmp/comicbook-thumbnails/comiccreator.cpp:294:
/home/lestek/tmp/comicbook-thumbnails/build/comiccreator.moc:12:2: error: #error "The header file 'comiccreator.h' doesn't include <QObject>."
/home/lestek/tmp/comicbook-thumbnails/build/comiccreator.moc:13:7: warning: "Q_MOC_OUTPUT_REVISION" is not defined
In file included from /home/lestek/tmp/comicbook-thumbnails/comiccreator.cpp:20:
/home/lestek/tmp/comicbook-thumbnails/comiccreator.h:34: error: expected class-name before ‘,’ token
/home/lestek/tmp/comicbook-thumbnails/comiccreator.h:35: error: ISO C++ forbids declaration of ‘Q_OBJECT’ with no type
/home/lestek/tmp/comicbook-thumbnails/comiccreator.h:36: error: expected ‘;’ before ‘public’
/home/lestek/tmp/comicbook-thumbnails/comiccreator.h:49: error: ‘QByteArray’ does not name a type
/home/lestek/tmp/comicbook-thumbnails/comiccreator.h:50: error: ‘QByteArray’ does not name a type
/home/lestek/tmp/comicbook-thumbnails/comiccreator.h:51: error: ISO C++ forbids declaration of ‘QEventLoop’ with no type
/home/lestek/tmp/comicbook-thumbnails/comiccreator.h:51: error: expected ‘;’ before ‘*’ token
/home/lestek/tmp/comicbook-thumbnails/comiccreator.h:55: error: ‘QStringList’ has not been declared
/home/lestek/tmp/comicbook-thumbnails/comiccreator.h:59: error: ‘QStringList’ has not been declared
/home/lestek/tmp/comicbook-thumbnails/comiccreator.h:62: error: ‘QStringList’ has not been declared
/home/lestek/tmp/comicbook-thumbnails/comiccreator.h:63: error: ‘QStringList’ has not been declared
/home/lestek/tmp/comicbook-thumbnails/comiccreator.h:64: error: expected ‘:’ before ‘Q_SLOTS’
/home/lestek/tmp/comicbook-thumbnails/comiccreator.h:65: error: expected primary-expression before ‘void’
/home/lestek/tmp/comicbook-thumbnails/comiccreator.h:65: error: ISO C++ forbids declaration of ‘Q_SLOTS’ with no type
/home/lestek/tmp/comicbook-thumbnails/comiccreator.h:65: error: expected ‘;’ before ‘void’
/home/lestek/tmp/comicbook-thumbnails/comiccreator.h:67: error: ‘QProcess’ has not been declared
/home/lestek/tmp/comicbook-thumbnails/comiccreator.h:67: error: expected ‘,’ or ‘...’ before ‘exitStatus’
In file included from /usr/include/kzip.h:21,
from /home/lestek/tmp/comicbook-thumbnails/comiccreator.cpp:23:
/usr/include/karchive.h:61: error: expected ‘)’ before ‘*’ token
/usr/include/karchive.h:72: error: ‘QIODevice’ has not been declared
/usr/include/karchive.h:72: error: expected ‘,’ or ‘...’ before ‘mode’
/usr/include/karchive.h:94: error: ‘QIODevice’ has not been declared
/usr/include/karchive.h:94: error: expected ‘;’ before ‘mode’
/usr/include/karchive.h:100: error: expected ‘;’ before ‘*’ token
/usr/include/karchive.h:200: error: ‘qint64’ has not been declared
/usr/include/karchive.h:224: error: ‘qint64’ has not been declared
/usr/include/karchive.h:231: error: ‘qint64’ has not been declared
/usr/include/karchive.h:238: error: ‘qint64’ has not been declared
/usr/include/karchive.h:246: error: ‘QIODevice’ has not been declared
/usr/include/karchive.h:246: error: expected ‘,’ or ‘...’ before ‘mode’
/usr/include/karchive.h:315: error: ‘qint64’ has not been declared
/usr/include/karchive.h:325: error: ‘qint64’ has not been declared
/usr/include/karchive.h:341: error: ‘QIODevice’ has not been declared
/usr/include/karchive.h:341: error: expected ‘,’ or ‘...’ before ‘mode’
/usr/include/karchive.h:347: error: ‘QIODevice’ has not been declared
/usr/include/karchive.h:392: error: ‘QDateTime’ does not name a type
/usr/include/karchive.h:474: error: ‘qint64’ has not been declared
/usr/include/karchive.h:474: error: ‘qint64’ has not been declared
/usr/include/karchive.h:485: error: ‘qint64’ does not name a type
/usr/include/karchive.h:490: error: ‘qint64’ does not name a type
/usr/include/karchive.h:495: error: ‘qint64’ has not been declared
/usr/include/karchive.h:502: error: ‘QByteArray’ does not name a type
/usr/include/karchive.h:514: error: ‘QIODevice’ declared as a ‘virtual’ field
/usr/include/karchive.h:514: error: expected ‘;’ before ‘*’ token
/usr/include/karchive.h:568: error: ‘QStringList’ does not name a type
In file included from /home/lestek/tmp/comicbook-thumbnails/comiccreator.cpp:23:
/usr/include/kzip.h:62: error: expected ‘)’ before ‘*’ token
/usr/include/kzip.h:122: error: ‘qint64’ has not been declared
/usr/include/kzip.h:131: error: ‘qint64’ has not been declared
/usr/include/kzip.h:139: error: ‘qint64’ has not been declared
/usr/include/kzip.h:147: error: ‘QIODevice’ has not been declared
/usr/include/kzip.h:147: error: expected ‘,’ or ‘...’ before ‘mode’
/usr/include/kzip.h:179: error: ‘qint64’ has not been declared
/usr/include/kzip.h:179: error: ‘qint64’ has not been declared
/usr/include/kzip.h:180: error: ‘qint64’ has not been declared
/usr/include/kzip.h:188: error: ‘qint64’ does not name a type
/usr/include/kzip.h:191: error: ‘qint64’ has not been declared
/usr/include/kzip.h:194: error: ‘qint64’ has not been declared
/usr/include/kzip.h:195: error: ‘qint64’ does not name a type
/usr/include/kzip.h:208: error: ‘QByteArray’ does not name a type
/usr/include/kzip.h:217: error: ‘QIODevice’ declared as a ‘virtual’ field
/usr/include/kzip.h:217: error: expected ‘;’ before ‘*’ token
In file included from /usr/include/kmimetype.h:26,
from /home/lestek/tmp/comicbook-thumbnails/comiccreator.cpp:24:
/usr/include/kurl.h:112: error: expected class-name before ‘{’ token
/usr/include/kurl.h:114: error: expected ‘;’ before ‘<’ token
/usr/include/kurl.h:125: error: expected template-name before ‘<’ token
/usr/include/kurl.h:125: error: expected ‘{’ before ‘<’ token
/usr/include/kurl.h:125: error: expected unqualified-id before ‘<’ token
In file included from /home/lestek/tmp/comicbook-thumbnails/comiccreator.cpp:294:
/home/lestek/tmp/comicbook-thumbnails/build/comiccreator.moc:81: error: expected ‘}’ at end of input
/home/lestek/tmp/comicbook-thumbnails/build/comiccreator.moc:81: error: expected unqualified-id at end of input
make[2]: *** [CMakeFiles/comicbookthumbnail.dir/comiccreator.o] Error 1
make[1]: *** [CMakeFiles/comicbookthumbnail.dir/all] Error 2
make: *** [all] Error 2
lestek@laptop:~/tmp/comicbook-thumbnails/build$

(Karmic Koala 9.10, Kde 4.3.2, x64) - Oct 25 2009
Yakuake

System Software by Sho 1027 comments

Great app!
I have only one problem:
After system start, yakuake loses its transparency. To recreate it I must restart yakuake (maybe its because I using compiz) - Aug 26 2009
Smooth Tasks

Plasma 4 Extensions by panzi 842 comments

Can you add option to disable previews, please? I don't see any previews anyway, only blank squares, besides it don't look good with previews enabled in compiz. - Aug 14 2009
Polish Radio

Amarok 2.x Scripts
by kubdat

6.8
Nov 08 2009
Root Actions Servicemenu

Dolphin Service Menus
by kubicle

8.6
Nov 04 2009
Yakuake

System Software
by Sho

8.6
Aug 21 2009
kydpdict

Education Apps
by ytm

5.7
Aug 21 2009
GX Mail Notify

Plasma 4 Extensions
by Goffix

6.4
Aug 21 2009
Device Manager

Plasma 4 Extensions
by giucam

6.6
Aug 21 2009
Smooth Tasks

Plasma 4 Extensions
by panzi

8.6
Aug 19 2009
5.0
Aug 19 2009