Image 01
profile-image

Linkin

jack black
Plasma WiFi

Plasma 4 Extensions by ochoha 52 comments

There is also a third: KDEmod. Im using their unstable repo with recent upgrades. Latest update was today package version number is 4.0.81. The repo is here: http://kdemod.ath.cx/repo/unstable/i686/ . There is a discussion on there forums about this testing packages http://kdemod.ath.cx/bbs/viewtopic.php?id=406

I hope this information was of use to you. - May 28 2008
Plasma WiFi

Plasma 4 Extensions by ochoha 52 comments

Sorry to ask this as it seems to be kinda stupid but how can I see which version my kdelibs are? - May 13 2008
Plasma WiFi

Plasma 4 Extensions by ochoha 52 comments

Thanks, I'd really love to use this plasmoid. - May 09 2008
Plasma WiFi

Plasma 4 Extensions by ochoha 52 comments

I'm having the following errors:

/home/chrissi/plasma-wifi/src/plasma-wifi-0.4/plasma-wifi-signal.cpp: In constructor »Plasma_WiFi_Signal_Strength::Plasma_WiFi_Signal_Strength(QObject*, const QVariantList&)«:
/home/chrissi/plasma-wifi/src/plasma-wifi-0.4/plasma-wifi-signal.cpp:37: Fehler: »setDrawStandardBackground« wurde in diesem Gültigkeitsbereich nicht definiert
/home/chrissi/plasma-wifi/src/plasma-wifi-0.4/plasma-wifi-signal.cpp: In member function »virtual void Plasma_WiFi_Signal_Strength::init()«:
/home/chrissi/plasma-wifi/src/plasma-wifi-0.4/plasma-wifi-signal.cpp:57: Fehler: »self« ist kein Element von »Plasma::Theme«
/home/chrissi/plasma-wifi/src/plasma-wifi-0.4/plasma-wifi-signal.cpp:58: Fehler: »self« ist kein Element von »Plasma::Theme«
/home/chrissi/plasma-wifi/src/plasma-wifi-0.4/plasma-wifi-signal.cpp: In member function »void Plasma_WiFi_Signal_Strength::paintAntenna(QPainter*, const QRect&)«:
/home/chrissi/plasma-wifi/src/plasma-wifi-0.4/plasma-wifi-signal.cpp:119: Fehler: keine passende Funktion für Aufruf von »Plasma::Svg::Svg(QString&, Plasma_WiFi_Signal_Strength* const)«
/opt/kdemod/include/plasma/svg.h:72: Anmerkung: Kandidaten sind: Plasma::Svg::Svg(QObject*)
/opt/kdemod/include/plasma/svg.h:48: Anmerkung: Plasma::Svg::Svg(const Plasma::Svg&)
/home/chrissi/plasma-wifi/src/plasma-wifi-0.4/plasma-wifi-signal.cpp:120: Fehler: »class Plasma::Svg« hat kein Element namens »setContentType«
/home/chrissi/plasma-wifi/src/plasma-wifi-0.4/plasma-wifi-signal.cpp:120: Fehler: »SingleImage« ist kein Element von »Plasma::Svg«
/home/chrissi/plasma-wifi/src/plasma-wifi-0.4/plasma-wifi-signal.cpp:121: Fehler: »contentSize« wurde in diesem Gültigkeitsbereich nicht definiert
/home/chrissi/plasma-wifi/src/plasma-wifi-0.4/plasma-wifi-signal.cpp:123: Fehler: »class Plasma::Svg« hat kein Element namens »elementExists«
/home/chrissi/plasma-wifi/src/plasma-wifi-0.4/plasma-wifi-signal.cpp:151: Fehler: »class Plasma::Svg« hat kein Element namens »elementExists«
/home/chrissi/plasma-wifi/src/plasma-wifi-0.4/plasma-wifi-signal.cpp: In member function »QSizeF Plasma_WiFi_Signal_Strength::contentSizeHint() const«:
/home/chrissi/plasma-wifi/src/plasma-wifi-0.4/plasma-wifi-signal.cpp:220: Fehler: »contentSize« wurde in diesem Gültigkeitsbereich nicht definiert
make[2]: *** [CMakeFiles/plasma_applet_wifi_signal.dir/plasma-wifi-signal.o] Fehler 1
make[1]: *** [CMakeFiles/plasma_applet_wifi_signal.dir/all] Fehler 2
make: *** [all] Fehler 2

I'm on ArchLinux, cmake is version 2.4-patch 8. How can i fix the errors?
- May 05 2008