Image 01
profile-image

linxl

Luigi Conversini Tarquinia, Italy
gtk-kde4

Various KDE 1.-4. Improvements by Apoclypse 305 comments

Your app is great :)
I've got this strange issue only with openoffice:

http://img404.imageshack.us/img404/9500/openoffice.png

Thank you for your work and efforts!

L - Feb 15 2010
Customizable Weather Plasmoid (CWP)

Plasma 4 Extensions by jaegerschnitzel 1069 comments

It works again... but I think it would be great to have the possibility to choose between differents forecast site.
I've tried, but I didn't manage to create my own xml file for www.meteo.it.

Thanks!

Luigi - Jan 15 2010
Customizable Weather Plasmoid (CWP)

Plasma 4 Extensions by jaegerschnitzel 1069 comments

Well the new fix for ilmeteo.it worked fine till yesterday night. Then it has been impossible for cwp to show forecast for my city and Rome too. I don't know why.
Well I would like to thank you for your effort first and then I would try to suggest you to add a new site to the list.
I found this one www.meteo.it. This site looks more efficient than www.ilmeteo.it.

Thank you again!

Luigi - Jan 15 2010
Pushkin

Fonts by west 59 comments

Hi! your font is amazing.
Can you add these two characters: ì and ò?

Than you!

L - Dec 18 2009
Customizable Weather Plasmoid (CWP)

Plasma 4 Extensions by jaegerschnitzel 1069 comments

There is current temperature... I don't know why you can't see it! Browser problem?

I'll say it again: everything works with 0.9.15 and 0.9.16

The site provides all kind of informations about my city, Rome and all other italian cities!
now it's 10.5°C (I'm using your plasmoid version 0.9.15)

h. 01.00 sereno 10.5° SE SE 6 / max 16 debole 10 °C 11 °C 96% 1024mb >10km buona0 3260m
(copied and merged from the site right now) - Nov 13 2009
Customizable Weather Plasmoid (CWP)

Plasma 4 Extensions by jaegerschnitzel 1069 comments

There is current temperature... I don't know why you can't see it! Browser problem?

I'll say it again: everything works with 0.9.15 and 0.9.16

The site provides all kind of informations about my city, Rome and all other italian cities!
now it's 10.5°C (I'm using your plasmoid version 0.9.15)

h. 01.00 sereno 10.5° SE SE 6 / max 16 debole 10 °C 11 °C 96% 1024mb >10km buona0 3260m
(copied and merged from the site right now) - Nov 13 2009
Customizable Weather Plasmoid (CWP)

Plasma 4 Extensions by jaegerschnitzel 1069 comments

Well ilmeteo.it provides infos about Tarquinia and says even where is located:

Comune di Tarquinia (VT) - CAP 01016 - 133 metri s.l.m. (I've copied and merged this from the link in your message: http://www.ilmeteo.it/meteo/Tarquinia)

Believe me! ilmeteo.xml 0.9.17 does not work! - Nov 13 2009
Customizable Weather Plasmoid (CWP)

Plasma 4 Extensions by jaegerschnitzel 1069 comments

If you choose Tarquinia (my city) the new xml (0.9.17) doesn't work- everything's ok with version 0.9.15 or 0.9.16
I don't know why... - Nov 13 2009
Oxygen Blue Air

Plasma Themes by PS5001 5 comments

Here's the link to the thread with the solution:

http://forum.kde.org/viewtopic.php?f=17&t=83671 - Nov 12 2009
Customizable Weather Plasmoid (CWP)

Plasma 4 Extensions by jaegerschnitzel 1069 comments

Indeed the problem persits... CWP 0.9.17 doesn't load data from ilmeteo.it

Thanks and sorry agaun for these strange messages!

L - Nov 11 2009
Customizable Weather Plasmoid (CWP)

Plasma 4 Extensions by jaegerschnitzel 1069 comments

I was wrong! I've tested again now and work perfectly!

Sorry!!!

L - Nov 11 2009
Customizable Weather Plasmoid (CWP)

Plasma 4 Extensions by jaegerschnitzel 1069 comments

With this new version (0.9.17) CWP is not able to connect to ilmeteo.it... Please can you solve the trick?
Great plasmoid!

Thank you! - Nov 11 2009
Oxygen Blue Air

Plasma Themes by PS5001 5 comments

Hi! Thanks for your answer!
I can affirm you that your theme works perfectly even with kde 4.3.3 and compiz (there are no problems at all if with kwin effects are on).
I've talked about the transparency problem I encountered even by running compiz and the default plasma-theme: Air, in Kde Forum.
It's Plasma that generates this issue: to let transparency work (and consequently your theme too) you must run compiz, quit plasma and then run plasma again using krunner or console.
These are the commands in order:
I let fusion-icon and compiz run from kde-start.
Then I run "kquitapp plasma-desktop", I wait some seconds and run plasma-desktop, and the trick solved ;)
I hope this would help you!
Yours is a great theme set: the only one I didn't manage to install is Grubtheme, because now kubuntu has Grub2 installed as default.

Thank you!

L - Nov 10 2009
Oxygen Blue Air

Plasma Themes by PS5001 5 comments

As I say in the subject the theme does not work with compiz enabled.
It works with Kwin effects, but only once I changed a line in metadata.desktop in order to let it apply:

X-KDE-PluginInfo-Name=default - it's wrong, "default" has to be substituted with the name of the theme-directory.


I'm on Karmic with KDE 4.3.3
It would be great if you'll
create out from the Oxygen-blue-air.emerald theme a new window decoration for Kwin!
Thank you!

L - Nov 08 2009
Oxygen Blue Air

KDE 4 Splashscreens by PS5001 2 comments

Hi! I'd really like to download your theme set, but file factory does not work.
Can you change upload service?
Thank you! - Nov 08 2009
Customizable Weather Plasmoid (CWP)

Plasma 4 Extensions by jaegerschnitzel 1069 comments

I've tried to follow the indications I found in your readme file, but nothing came out!

Probably I made mistake I can not recognize...


Could you help?? - Apr 16 2009
Customizable Weather Plasmoid (CWP)

Plasma 4 Extensions by jaegerschnitzel 1069 comments

thank you for your advice!
I'll read your readme file!
I'd like to import www.ilmeteo.it.

Do you think this could be possible?

Thnaks in advance!

L - Apr 16 2009
Customizable Weather Plasmoid (CWP)

Plasma 4 Extensions by jaegerschnitzel 1069 comments

Great plasmoid!
Just a question: could you post a how-to for .xml configuration file?
I'd like to use an italian site for the forecast!

Thank you

L - Apr 16 2009
Magic Folder

Plasma 4 Extensions by bizzl 66 comments

done it!! ;) - Mar 11 2009
Magic Folder

Plasma 4 Extensions by bizzl 66 comments

How can I compilethis plasmoid??

Thank you! - Mar 11 2009
gtk-kde4

Various KDE 1.-4. Improvements by Apoclypse 305 comments

Hi!
The app install, but use kde style doesn't work... - Apr 02 2008
gtk-kde4

Various KDE 1.-4. Improvements by Apoclypse 305 comments

Hi!

I was curios to try this new version but I got compiling errors:

Quote:lu@ASUS:~/gtk-kde4$ qmake -unix
lu@ASUS:~/gtk-kde4$ make
g++ -c -pipe -O2 -Wall -W -D_REENTRANT -DQT_NO_DEBUG -DQT_GUI_LIB -DQT_CORE_LIB -DQT_SHARED -I/opt/qt4/mkspecs/linux-g++ -I. -I/opt/qt4/include/QtCore -I/opt/qt4/include/QtCore -I/opt/qt4/include/QtGui -I/opt/qt4/include/QtGui -I/opt/qt4/include -Ibuild -Ibuild -o build/form1.o src/form1.cpp
src/form1.cpp: In constructor ‘form1::form1(QWidget*, Qt::WFlags)’:
src/form1.cpp:107: error: ‘comboBox2’ was not declared in this scope
src/form1.cpp:123: error: ‘actionAbout’ was not declared in this scope
src/form1.cpp:126: error: ‘actionRussian’ was not declared in this scope
src/form1.cpp:127: error: ‘actionGerman’ was not declared in this scope
src/form1.cpp:128: error: ‘actionEnglish’ was not declared in this scope
src/form1.cpp:129: error: ‘actionUkranian’ was not declared in this scope
src/form1.cpp:130: error: ‘actionRomanian’ was not declared in this scope
src/form1.cpp:131: error: ‘actionBelorussian’ was not declared in this scope
src/form1.cpp:132: error: ‘actionFrench’ was not declared in this scope
src/form1.cpp:133: error: ‘actionSpanish’ was not declared in this scope
src/form1.cpp:134: error: ‘actionItalian’ was not declared in this scope
src/form1.cpp: In member function ‘void form1::OKReleased()’:
src/form1.cpp:615: error: ‘comboBox2’ was not declared in this scope
src/form1.cpp: In member function ‘void form1::rus()’:
src/form1.cpp:697: error: ‘menuFile’ was not declared in this scope
src/form1.cpp:698: error: ‘menuLanguage’ was not declared in this scope
src/form1.cpp:699: error: ‘menuHelp’ was not declared in this scope
src/form1.cpp:700: error: ‘actionExit’ was not declared in this scope
src/form1.cpp:701: error: ‘actionAbout’ was not declared in this scope
src/form1.cpp:707: error: ‘label2’ was not declared in this scope
src/form1.cpp: In member function ‘void form1::ger()’:
src/form1.cpp:712: error: ‘menuFile’ was not declared in this scope
src/form1.cpp:713: error: ‘menuLanguage’ was not declared in this scope
src/form1.cpp:714: error: ‘menuHelp’ was not declared in this scope
src/form1.cpp:715: error: ‘actionExit’ was not declared in this scope
src/form1.cpp:716: error: ‘actionAbout’ was not declared in this scope
src/form1.cpp:722: error: ‘label2’ was not declared in this scope
src/form1.cpp: In member function ‘void form1::ukr()’:
src/form1.cpp:727: error: ‘menuFile’ was not declared in this scope
src/form1.cpp:728: error: ‘menuLanguage’ was not declared in this scope
src/form1.cpp:729: error: ‘menuHelp’ was not declared in this scope
src/form1.cpp:730: error: ‘actionExit’ was not declared in this scope
src/form1.cpp:731: error: ‘actionAbout’ was not declared in this scope
src/form1.cpp:737: error: ‘label2’ was not declared in this scope
src/form1.cpp: In member function ‘void form1::eng()’:
src/form1.cpp:742: error: ‘actionAbout’ was not declared in this scope
src/form1.cpp:743: error: ‘actionExit’ was not declared in this scope
src/form1.cpp:749: error: ‘menuFile’ was not declared in this scope
src/form1.cpp:750: error: ‘menuLanguage’ was not declared in this scope
src/form1.cpp:751: error: ‘menuHelp’ was not declared in this scope
src/form1.cpp:752: error: ‘label2’ was not declared in this scope
src/form1.cpp: In member function ‘void form1::bel()’:
src/form1.cpp:757: error: ‘menuFile’ was not declared in this scope
src/form1.cpp:758: error: ‘menuLanguage’ was not declared in this scope
src/form1.cpp:759: error: ‘menuHelp’ was not declared in this scope
src/form1.cpp:760: error: ‘actionExit’ was not declared in this scope
src/form1.cpp:761: error: ‘actionAbout’ was not declared in this scope
src/form1.cpp: In member function ‘void form1::rom()’:
src/form1.cpp:771: error: ‘menuFile’ was not declared in this scope
src/form1.cpp:772: error: ‘menuLanguage’ was not declared in this scope
src/form1.cpp:773: error: ‘menuHelp’ was not declared in this scope
src/form1.cpp:774: error: ‘actionExit’ was not declared in this scope
src/form1.cpp:775: error: ‘actionAbout’ was not declared in this scope
src/form1.cpp:781: error: ‘label2’ was not declared in this scope
src/form1.cpp: In member function ‘void form1::fra()’:
src/form1.cpp:786: error: ‘menuFile’ was not declared in this scope
src/form1.cpp:787: error: ‘menuLanguage’ was not declared in this scope
src/form1.cpp:788: error: ‘menuHelp’ was not declared in this scope
src/form1.cpp:789: error: ‘actionExit’ was not declared in this scope
src/form1.cpp:790: error: ‘actionAbout’ was not declared in this scope
src/form1.cpp:796: error: ‘label2’ was not declared in this scope
src/form1.cpp: In member function ‘void form1::spa()’:
src/form1.cpp:801: error: ‘menuFile’ was not declared in this scope
src/form1.cpp:802: error: ‘menuLanguage’ was not declared in this scope
src/form1.cpp:803: error: ‘menuHelp’ was not declared in this scope
src/form1.cpp:804: error: ‘actionExit’ was not declared in this scope
src/form1.cpp:805: error: ‘actionAbout’ was not declared in this scope
src/form1.cpp:811: error: ‘label2’ was not declared in this scope
src/form1.cpp: In member function ‘void form1::ita()’:
src/form1.cpp:816: error: ‘menuFile’ was not declared in this scope
src/form1.cpp:817: error: ‘menuLanguage’ was not declared in this scope
src/form1.cpp:818: error: ‘menuHelp’ was not declared in this scope
src/form1.cpp:819: error: ‘actionExit’ was not declared in this scope
src/form1.cpp:820: error: ‘actionAbout’ was not declared in this scope
src/form1.cpp:826: error: ‘label2’ was not declared in this scope
make: *** [build/form1.o] Error 1


Thank you! - Mar 20 2008
gtk-kde4

Various KDE 1.-4. Improvements by Apoclypse 305 comments

Hi!

I was curios to try this new version but I got compiling errors:

Quote:lu@ASUS:~/gtk-kde4$ qmake -unix
lu@ASUS:~/gtk-kde4$ make
g++ -c -pipe -O2 -Wall -W -D_REENTRANT -DQT_NO_DEBUG -DQT_GUI_LIB -DQT_CORE_LIB -DQT_SHARED -I/opt/qt4/mkspecs/linux-g++ -I. -I/opt/qt4/include/QtCore -I/opt/qt4/include/QtCore -I/opt/qt4/include/QtGui -I/opt/qt4/include/QtGui -I/opt/qt4/include -Ibuild -Ibuild -o build/form1.o src/form1.cpp
src/form1.cpp: In constructor ‘form1::form1(QWidget*, Qt::WFlags)’:
src/form1.cpp:107: error: ‘comboBox2’ was not declared in this scope
src/form1.cpp:123: error: ‘actionAbout’ was not declared in this scope
src/form1.cpp:126: error: ‘actionRussian’ was not declared in this scope
src/form1.cpp:127: error: ‘actionGerman’ was not declared in this scope
src/form1.cpp:128: error: ‘actionEnglish’ was not declared in this scope
src/form1.cpp:129: error: ‘actionUkranian’ was not declared in this scope
src/form1.cpp:130: error: ‘actionRomanian’ was not declared in this scope
src/form1.cpp:131: error: ‘actionBelorussian’ was not declared in this scope
src/form1.cpp:132: error: ‘actionFrench’ was not declared in this scope
src/form1.cpp:133: error: ‘actionSpanish’ was not declared in this scope
src/form1.cpp:134: error: ‘actionItalian’ was not declared in this scope
src/form1.cpp: In member function ‘void form1::OKReleased()’:
src/form1.cpp:615: error: ‘comboBox2’ was not declared in this scope
src/form1.cpp: In member function ‘void form1::rus()’:
src/form1.cpp:697: error: ‘menuFile’ was not declared in this scope
src/form1.cpp:698: error: ‘menuLanguage’ was not declared in this scope
src/form1.cpp:699: error: ‘menuHelp’ was not declared in this scope
src/form1.cpp:700: error: ‘actionExit’ was not declared in this scope
src/form1.cpp:701: error: ‘actionAbout’ was not declared in this scope
src/form1.cpp:707: error: ‘label2’ was not declared in this scope
src/form1.cpp: In member function ‘void form1::ger()’:
src/form1.cpp:712: error: ‘menuFile’ was not declared in this scope
src/form1.cpp:713: error: ‘menuLanguage’ was not declared in this scope
src/form1.cpp:714: error: ‘menuHelp’ was not declared in this scope
src/form1.cpp:715: error: ‘actionExit’ was not declared in this scope
src/form1.cpp:716: error: ‘actionAbout’ was not declared in this scope
src/form1.cpp:722: error: ‘label2’ was not declared in this scope
src/form1.cpp: In member function ‘void form1::ukr()’:
src/form1.cpp:727: error: ‘menuFile’ was not declared in this scope
src/form1.cpp:728: error: ‘menuLanguage’ was not declared in this scope
src/form1.cpp:729: error: ‘menuHelp’ was not declared in this scope
src/form1.cpp:730: error: ‘actionExit’ was not declared in this scope
src/form1.cpp:731: error: ‘actionAbout’ was not declared in this scope
src/form1.cpp:737: error: ‘label2’ was not declared in this scope
src/form1.cpp: In member function ‘void form1::eng()’:
src/form1.cpp:742: error: ‘actionAbout’ was not declared in this scope
src/form1.cpp:743: error: ‘actionExit’ was not declared in this scope
src/form1.cpp:749: error: ‘menuFile’ was not declared in this scope
src/form1.cpp:750: error: ‘menuLanguage’ was not declared in this scope
src/form1.cpp:751: error: ‘menuHelp’ was not declared in this scope
src/form1.cpp:752: error: ‘label2’ was not declared in this scope
src/form1.cpp: In member function ‘void form1::bel()’:
src/form1.cpp:757: error: ‘menuFile’ was not declared in this scope
src/form1.cpp:758: error: ‘menuLanguage’ was not declared in this scope
src/form1.cpp:759: error: ‘menuHelp’ was not declared in this scope
src/form1.cpp:760: error: ‘actionExit’ was not declared in this scope
src/form1.cpp:761: error: ‘actionAbout’ was not declared in this scope
src/form1.cpp: In member function ‘void form1::rom()’:
src/form1.cpp:771: error: ‘menuFile’ was not declared in this scope
src/form1.cpp:772: error: ‘menuLanguage’ was not declared in this scope
src/form1.cpp:773: error: ‘menuHelp’ was not declared in this scope
src/form1.cpp:774: error: ‘actionExit’ was not declared in this scope
src/form1.cpp:775: error: ‘actionAbout’ was not declared in this scope
src/form1.cpp:781: error: ‘label2’ was not declared in this scope
src/form1.cpp: In member function ‘void form1::fra()’:
src/form1.cpp:786: error: ‘menuFile’ was not declared in this scope
src/form1.cpp:787: error: ‘menuLanguage’ was not declared in this scope
src/form1.cpp:788: error: ‘menuHelp’ was not declared in this scope
src/form1.cpp:789: error: ‘actionExit’ was not declared in this scope
src/form1.cpp:790: error: ‘actionAbout’ was not declared in this scope
src/form1.cpp:796: error: ‘label2’ was not declared in this scope
src/form1.cpp: In member function ‘void form1::spa()’:
src/form1.cpp:801: error: ‘menuFile’ was not declared in this scope
src/form1.cpp:802: error: ‘menuLanguage’ was not declared in this scope
src/form1.cpp:803: error: ‘menuHelp’ was not declared in this scope
src/form1.cpp:804: error: ‘actionExit’ was not declared in this scope
src/form1.cpp:805: error: ‘actionAbout’ was not declared in this scope
src/form1.cpp:811: error: ‘label2’ was not declared in this scope
src/form1.cpp: In member function ‘void form1::ita()’:
src/form1.cpp:816: error: ‘menuFile’ was not declared in this scope
src/form1.cpp:817: error: ‘menuLanguage’ was not declared in this scope
src/form1.cpp:818: error: ‘menuHelp’ was not declared in this scope
src/form1.cpp:819: error: ‘actionExit’ was not declared in this scope
src/form1.cpp:820: error: ‘actionAbout’ was not declared in this scope
src/form1.cpp:826: error: ‘label2’ was not declared in this scope
make: *** [build/form1.o] Error 1


Thank you! - Mar 20 2008
gtk-kde4

Various KDE 1.-4. Improvements by Apoclypse 305 comments

Well, there is just a few colors adjustment to let it all look more "integreted" in kde4 environment.

http://img176.imageshack.us/my.php?image=snapshot2lv9.png

As you can see in the image menu bars contours are coloured, and if somethings is selected (texts into the app's window, or even firefox menus - emesene's menus are in kde oxygen style (grey if selected) as file roller's one too -) they're painted dark blue instead of light blue.

Take all this just as a suggestion, I just hope helping you by improving your app ;-)

Thank you!!!!

- Feb 19 2008
gtk-kde4

Various KDE 1.-4. Improvements by Apoclypse 305 comments

IT WORKS PERFECTLY!!!

Great work!!!

Than you! - Feb 19 2008
gtk-kde4

Various KDE 1.-4. Improvements by Apoclypse 305 comments

Now I can't install ver. 0.4.2 ...

I get this error:

Quote:lu@ASUS:~$ cd gtk-kde4
lu@ASUS:~/gtk-kde4$ qmake -unix
lu@ASUS:~/gtk-kde4$ make
/opt/qt4/bin/uic ui/form1.ui -o build/ui_form1.h
g++ -c -pipe -O2 -Wall -W -D_REENTRANT -DQT_NO_DEBUG -DQT_GUI_LIB -DQT_CORE_LIB -DQT_SHARED -I/opt/qt4/mkspecs/linux-g++ -I. -I/opt/qt4/include/QtCore -I/opt/qt4/include/QtCore -I/opt/qt4/include/QtGui -I/opt/qt4/include/QtGui -I/opt/qt4/include -Ibuild -Ibuild -o build/form1.o src/form1.cpp
src/form1.cpp: In member function ‘void form1::OKReleased()’:
src/form1.cpp:147: error: ‘tableitem’ was not declared in this scope
make: *** [build/form1.o] Error 1 - Feb 19 2008
gtk-kde4

Various KDE 1.-4. Improvements by Apoclypse 305 comments

ThanKs!! - Feb 17 2008
gtk-kde4

Various KDE 1.-4. Improvements by Apoclypse 305 comments

the problem remains. With oxygnome it's ok, but "Use current kde style" (oxygen) doesn't work properly...

- Feb 17 2008
gtk-kde4

Various KDE 1.-4. Improvements by Apoclypse 305 comments

the problem remains. With oxygnome it's ok, but "Use current kde style" (oxygen) doesn't work properly...

- Feb 17 2008
gtk-kde4

Various KDE 1.-4. Improvements by Apoclypse 305 comments

It's not easy to explain the situation.

I've compiled KDE4 from svn with qt4.4.
Your app works only if compiled with qt4.4 too, everything's seems to be all right, but colors are not ok if I choose "use kde style". With Qt style gtk-kde4 works good.

Here's a snapshot
http://img523.imageshack.us/my.php?image=kde4062qt44hk6.png

Thank you!!! - Feb 16 2008
gtk-kde4

Various KDE 1.-4. Improvements by Apoclypse 305 comments

not so difficult indeed, but i found the last dependency i missed to let your app works: gtk-engines-pixmap

and now gtk-kde4 rocks!!!!

Great!!!!! - Feb 08 2008
gtk-kde4

Various KDE 1.-4. Improvements by Apoclypse 305 comments

Now the app has been installed, it opens but firefox has always his bad themes.
Even with other apps (file-roller) the themes doesn't apply, do I need specific dependencies insatlled?

Suggestion: can you write a short how-to about your app?

Thanks! - Feb 08 2008
gtk-kde4

Various KDE 1.-4. Improvements by Apoclypse 305 comments

The solution was to selct qmake-qt4... - Feb 08 2008
gtk-kde4

Various KDE 1.-4. Improvements by Apoclypse 305 comments

Well I guess It's the same problem Pik has by compiling...

I've libqt4-core, libqt4-gui and libqt4-dev installed too.

- Feb 08 2008
gtk-kde4

Various KDE 1.-4. Improvements by Apoclypse 305 comments

hi!

This is what I get when I try to install your app:

WARNING: Failure to find: src/form1.h
WARNING: Failure to find: src/form1.cpp
WARNING: Failure to find: src/main.cpp
WARNING: Failure to find: ui/form1.ui
WARNING: Found potential symbol conflict of form1.cpp (src/form1.cpp) in SOURCES
WARNING: Found potential symbol conflict of form1.h (src/form1.h) in HEADERS

Can you help??
I'm on Kubuntu 7.10
Thanks! - Feb 08 2008