Image 01
profile-image

mariostg

Mario St-Gelais
Kate PHP Browser Plugin

Developers Apps by tsilva 13 comments

Won't build :

/usr/include/antlr/CharScanner.hpp: In member function 'bool antlr::CharScannerL iteralsLess::operator()(const std::string&, const std::string&) const':
/usr/include/antlr/CharScanner.hpp:565: error: 'strcasecmp' was not declared in this scope
make[4]: *** [PHPLexer.lo] Error 1
make[4]: Leaving directory `/tmp/katephpbrowser-0.1beta/src/parser'
make[3]: *** [all] Error 2
make[3]: Leaving directory `/tmp/katephpbrowser-0.1beta/src/parser'
make[2]: *** [all-recursive] Error 1
make[2]: Leaving directory `/tmp/katephpbrowser-0.1beta/src'
make[1]: *** [all-recursive] Error 1
make[1]: Leaving directory `/tmp/katephpbrowser-0.1beta'
make: *** [all] Error 2
- Apr 26 2008