Image 01
profile-image

mrfaber

Faber 
KSystemLog

System Software by lastnico 117 comments

I don't think that the problem could be this, because I've compiled all KDE and several other qt-based software without problems.

AFAIK there is not a "qt-devel" package in Gentoo, because the qt one contains all the necessary to compile qt-based applications. - Jun 23 2005
KSystemLog

System Software by lastnico 117 comments

I'm on a Gentoo box, and ksystemlog 0.3.1 doesn't compile. There is an error while running the configure:

checking for Qt... configure: error: Qt (>= Qt 3.2) (library qt-mt) not found. Please check your installation!
For more details about this problem, look at the end of config.log.
Make sure that you have compiled Qt with thread support!

!!! ERROR: kde-misc/ksystemlog-0.3.1 failed.
!!! Function kde_src_compile, Line 154, Exitcode 1
!!! died running ./configure, kde_src_compile:configure
!!! If you need support, post the topmost build error, NOT this status message.

Note that I have qt 3.3.4-r3 installed. - Jun 23 2005
View as ASCII

Dolphin Service Menus by ljubomir 15 comments

Here's the italian translation:

Name[it]=Visualizza come ASCII

Cheers :) - Apr 24 2005
Metabar 0.7 Gentoo ebuild

Various KDE 1.-4. Improvements by blaster999 18 comments

Thank you, I've posted the error message on Metabar kde-apps page. - Apr 05 2005
Metabar

Various KDE 1.-4. Improvements by FJR 249 comments

I'm running Gentoo with KDE 3.3, and I can't compile Metabar 0.7. Here's the error:

/bin/sh ../libtool --silent --mode=compile --tag=CXX i686-pc-linux-gnu-g++ -DHAVE_CONFIG_H -I. -I. -I.. -I/usr/kde/3.3/include -I/usr/qt/3/include -I. -I/usr/kde/3.3/include/arts -DQT_THREAD_SUPPORT -D_REENTRANT -Wnon-virtual-dtor -Wno-long-long -Wundef -Wall -W -Wpointer-arith -Wwrite-strings -ansi -D_XOPEN_SOURCE=500 -D_BSD_SOURCE -Wcast-align -Wconversion -Wchar-subscripts -DNDEBUG -DNO_DEBUG -O2 -O2 -march=athlon-xp -pipe -fomit-frame-pointer -Wformat-security -Wmissing-format-attribute -fno-exceptions -fno-check-new -fno-common -c -o metabar.lo `test -f 'metabar.cpp' || echo './'`metabar.cpp
serviceloader.cpp: In member function `void
ServiceLoader::loadServices(KFileItem, QPtrList&)':
serviceloader.cpp:167: error: no matching function for call to `
KDEDesktopMimeType::userDefinedServices(const QString, KSimpleConfig&, bool)
'
/usr/kde/3.3/include/kmimetype.h:563: error: candidates are: static
QValueList
KDEDesktopMimeType::userDefinedServices(const QString&, bool)
make[2]: *** [serviceloader.lo] Error 1
make[2]: *** Waiting for unfinished jobs....
make[2]: Leaving directory `/var/tmp/portage/metabar-0.7/work/metabar/src'
make[1]: *** [all-recursive] Error 1
make[1]: Leaving directory `/var/tmp/portage/metabar-0.7/work/metabar'
make: *** [all] Error 2 - Apr 05 2005
Metabar 0.7 Gentoo ebuild

Various KDE 1.-4. Improvements by blaster999 18 comments

That's the error on my linux box:

/bin/sh ../libtool --silent --mode=compile --tag=CXX i686-pc-linux-gnu-g++ -DHAVE_CONFIG_H -I. -I. -I.. -I/usr/kde/3.3/include -I/usr/qt/3/include -I. -I/usr/kde/3.3/include/arts -DQT_THREAD_SUPPORT -D_REENTRANT -Wnon-virtual-dtor -Wno-long-long -Wundef -Wall -W -Wpointer-arith -Wwrite-strings -ansi -D_XOPEN_SOURCE=500 -D_BSD_SOURCE -Wcast-align -Wconversion -Wchar-subscripts -DNDEBUG -DNO_DEBUG -O2 -O2 -march=athlon-xp -pipe -fomit-frame-pointer -Wformat-security -Wmissing-format-attribute -fno-exceptions -fno-check-new -fno-common -c -o metabar.lo `test -f 'metabar.cpp' || echo './'`metabar.cpp
serviceloader.cpp: In member function `void
ServiceLoader::loadServices(KFileItem, QPtrList&)':
serviceloader.cpp:167: error: no matching function for call to `
KDEDesktopMimeType::userDefinedServices(const QString, KSimpleConfig&, bool)
'
/usr/kde/3.3/include/kmimetype.h:563: error: candidates are: static
QValueList
KDEDesktopMimeType::userDefinedServices(const QString&, bool)
make[2]: *** [serviceloader.lo] Error 1
make[2]: *** Waiting for unfinished jobs....
make[2]: Leaving directory `/var/tmp/portage/metabar-0.7/work/metabar/src'
make[1]: *** [all-recursive] Error 1
make[1]: Leaving directory `/var/tmp/portage/metabar-0.7/work/metabar'
make: *** [all] Error 2 - Apr 04 2005