Image 01
profile-image

N9NU

Tim Dickerson
Metabar

Various KDE 1.-4. Improvements by FJR 249 comments

I have the same problem you do. I added a comment as well. Im sure it is just a simple matter of editing a few things. I will mess around with it and if I get anything I will let you know

Tim
ARS N9NU - Oct 14 2005
Metabar

Various KDE 1.-4. Improvements by FJR 249 comments

I am having trouble running "make". I am using Mandriva Cooker with the latest QT version. Is there a work around for this issue yet? I get the following error:

In file included from metabar.cpp:6:
metabar.h:8:31: error: konqsidebarplugin.h: No such file or directory
metabar.h:14: error: expected class-name before '{' token
metabar.moc: In static member function 'static QMetaObject* Metabar::staticMetaObject()':
metabar.moc:54: error: 'KonqSidebarPlugin' has not been declared
metabar.moc: In member function 'virtual void* Metabar::qt_cast(const char*)':
metabar.moc:72: error: 'KonqSidebarPlugin' has not been declared
metabar.moc: In member function 'virtual bool Metabar::qt_invoke(int, QUObject*)':
metabar.moc:77: error: 'KonqSidebarPlugin' has not been declared
metabar.moc: In member function 'virtual bool Metabar::qt_emit(int, QUObject*)':
metabar.moc:82: error: 'KonqSidebarPlugin' has not been declared
metabar.moc: In member function 'virtual bool Metabar::qt_property(int, int, QVariant*)':
metabar.moc:88: error: 'KonqSidebarPlugin' has not been declared
metabar.cpp: In constructor 'Metabar::Metabar(KInstance*, QObject*, QWidget*, QString&, const char*)':
metabar.cpp:10: error: class 'Metabar' does not have any field named 'KonqSidebarPlugin'
make[2]: *** [metabar.lo] Error 1
make[2]: Leaving directory `/home/n9nu/downloads/metabar/src'
make[1]: *** [all-recursive] Error 1
make[1]: Leaving directory `/home/n9nu/downloads/metabar'
make: *** [all] Error 2 - Oct 14 2005