Image 01
profile-image

prodigy7

Manuel Bernhardt
Vistesque-Mod for Lipstik

Various KDE 1.-4. Styles by bonafide 120 comments

Hi,

When i try to compile the sources, i get the following error:

bigbrother lipstik-2.1 # make
make all-recursive
make[1]: Entering directory `/tmp/2/lipstik-2.1'
Making all in style
make[2]: Entering directory `/tmp/2/lipstik-2.1/style'
Making all in config
make[3]: Entering directory `/tmp/2/lipstik-2.1/style/config'
/usr/qt/3/bin/moc ./lipstikconf.h -o lipstikconf.moc
if /bin/sh ../../libtool --silent --mode=compile --tag=CXX g++ -DHAVE_CONFIG_H -I. -I. -I../.. -I/usr/kde/3.5/include -I/usr/qt/3/include -I. -DQT_THREAD_SUPPORT -D_REENTRANT -Wnon-virtual-dtor -Wno-long-long -Wundef -Wall -pedantic -W -Wpointer-arith -Wwrite-strings -ansi -D_XOPEN_SOURCE=500 -D_BSD_SOURCE -Wcast-align -Wconversion -Wchar-subscripts -O2 -Wformat-security -Wmissing-format-attribute -fno-exceptions -fno-check-new -fno-common -MT lipstikconf.lo -MD -MP -MF ".deps/lipstikconf.Tpo" -c -o lipstikconf.lo lipstikconf.cpp; \
then mv -f ".deps/lipstikconf.Tpo" ".deps/lipstikconf.Plo"; else rm -f ".deps/lipstikconf.Tpo"; exit 1; fi
/bin/sh ../../libtool --silent --mode=link --tag=CXX g++ -Wnon-virtual-dtor -Wno-long-long -Wundef -Wall -pedantic -W -Wpointer-arith -Wwrite-strings -ansi -D_XOPEN_SOURCE=500 -D_BSD_SOURCE -Wcast-align -Wconversion -Wchar-subscripts -O2 -Wformat-security -Wmissing-format-attribute -fno-exceptions -fno-check-new -fno-common -o kstyle_lipstik_config.la.closure kstyle_lipstik_config_la_closure.lo -L/usr/lib -L/usr/qt/3/lib -L/usr/kde/3.5/lib -avoid-version -module -no-undefined -R /usr/kde/3.5/lib -R /usr/qt/3/lib -R /usr/lib -module lipstikconf.lo -lkdeui
/bin/sh ../../libtool --silent --mode=link --tag=CXX g++ -Wnon-virtual-dtor -Wno-long-long -Wundef -Wall -pedantic -W -Wpointer-arith -Wwrite-strings -ansi -D_XOPEN_SOURCE=500 -D_BSD_SOURCE -Wcast-align -Wconversion -Wchar-subscripts -O2 -Wformat-security -Wmissing-format-attribute -fno-exceptions -fno-check-new -fno-common -o kstyle_lipstik_config.la -rpath /usr/kde/3.5/lib/kde3 -L/usr/lib -L/usr/qt/3/lib -L/usr/kde/3.5/lib -avoid-version -module -no-undefined -R /usr/kde/3.5/lib -R /usr/qt/3/lib -R /usr/lib -module lipstikconf.lo -lkdeui
make[3]: Leaving directory `/tmp/2/lipstik-2.1/style/config'
make[3]: Entering directory `/tmp/2/lipstik-2.1/style'
/usr/qt/3/bin/moc ./lipstik.h -o lipstik.moc
if /bin/sh ../libtool --silent --mode=compile --tag=CXX g++ -DHAVE_CONFIG_H -I. -I. -I.. -I/usr/kde/3.5/include -I/usr/qt/3/include -I. -DQT_THREAD_SUPPORT -D_REENTRANT -Wnon-virtual-dtor -Wno-long-long -Wundef -Wall -pedantic -W -Wpointer-arith -Wwrite-strings -ansi -D_XOPEN_SOURCE=500 -D_BSD_SOURCE -Wcast-align -Wconversion -Wchar-subscripts -O2 -Wformat-security -Wmissing-format-attribute -fno-exceptions -fno-check-new -fno-common -DQT_PLUGIN -MT lipstik.lo -MD -MP -MF ".deps/lipstik.Tpo" -c -o lipstik.lo lipstik.cpp; \
then mv -f ".deps/lipstik.Tpo" ".deps/lipstik.Plo"; else rm -f ".deps/lipstik.Tpo"; exit 1; fi
lipstik.cpp: In constructor `LipstikStyle::LipstikStyle()':
lipstik.cpp:207: error: `_enableVitesque' was not declared in this scope
lipstik.cpp:207: warning: unused variable '_enableVitesque'
lipstik.cpp: In member function `virtual void LipstikStyle::drawPrimitive(QStyle::PrimitiveElement, QPainter*, const QRect&, const QColorGroup&, uint, const QStyleOption&) const':
lipstik.cpp:2157: error: `_enableVitesque' was not declared in this scope
lipstik.cpp:2157: warning: unused variable '_enableVitesque'
lipstik.cpp:2190: error: `_enableVitesque' was not declared in this scope
lipstik.cpp:2190: warning: unused variable '_enableVitesque'
lipstik.cpp: In member function `virtual void LipstikStyle::drawControl(QStyle::ControlElement, QPainter*, const QWidget*, const QRect&, const QColorGroup&, uint, const QStyleOption&) const':
lipstik.cpp:2775: error: `_enableVitesque' was not declared in this scope
lipstik.cpp:2775: warning: unused variable '_enableVitesque'
lipstik.cpp:2791: error: `_enableVitesque' was not declared in this scope
lipstik.cpp:2791: warning: unused variable '_enableVitesque'
lipstik.cpp:2811: error: `_enableVitesque' was not declared in this scope
lipstik.cpp:2811: warning: unused variable '_enableVitesque'
lipstik.cpp:2829: error: `_enableVitesque' was not declared in this scope
lipstik.cpp:2829: warning: unused variable '_enableVitesque'
lipstik.cpp:2878: error: `_enableVitesque' was not declared in this scope
lipstik.cpp:2878: warning: unused variable '_enableVitesque'
lipstik.cpp:2889: error: `_enableVitesque' was not declared in this scope
lipstik.cpp:2889: warning: unused variable '_enableVitesque'
lipstik.cpp:2906: error: `_enableVitesque' was not declared in this scope
lipstik.cpp:2906: warning: unused variable '_enableVitesque'
lipstik.cpp:3132: error: `_enableVitesque' was not declared in this scope
lipstik.cpp:3132: warning: unused variable '_enableVitesque'
make[3]: *** [lipstik.lo] Error 1
make[3]: Leaving directory `/tmp/2/lipstik-2.1/style'
make[2]: *** [all-recursive] Error 1
make[2]: Leaving directory `/tmp/2/lipstik-2.1/style'
make[1]: *** [all-recursive] Error 1
make[1]: Leaving directory `/tmp/2/lipstik-2.1'
make: *** [all] Error 2

When i compile the "unpatched" lipstik, it compiles without any problems. I use kde 3.5.0 on Gentoo.

p7 - Jan 30 2006