Image 01
profile-image

rizon

Michael Michael Magua
test
Plastik Element preview

KDE 3.x Window Decorations 27 comments

by gr3gg
Score 50.0%
Nov 13 2004
then mv -f ".deps/factory.Tpo" ".deps/factory.Plo"; \
else rm -f ".deps/factory.Tpo"; exit 1; \
fi
In file included from factory.cpp:11:
factory.h:11:32: kdecorationfactory.h: No such file or directory
In file included from factory.cpp:11:
factory.h:20: error: expected class-name before '{' token
factory.h:26: error: ISO C++ forbids declaration of `KDecoration' with no type
factory.h:26: error: `KDecoration' declared as a `virtual' field
factory.h:26: error: expected `;' before '*' token
In file included from factory.cpp:12:
client.h:24: error: expected class-name before '{' token
client.h:28: error: expected `)' before '*' token
client.h:52: error: `Position' does not name a type
client.h:52: error: extra semicolon
client.h:24: warning: `class KDecorationWhid::Client' has virtual functions but non-virtual destructor
factory.cpp:19: error: extra `;'
factory.cpp: In member function `virtual bool KDecorationWhid::Factory::reset(long unsigned int)':
factory.cpp:50: error: `KDecoration' has not been declared
factory.cpp:50: error: `options' undeclared (first use this function)
factory.cpp:50: error: (Each undeclared identifier is reported only once for each function it appears in.)
factory.cpp:62: error: `resetDecorations' undeclared (first use this function)
factory.cpp: At global scope:
factory.cpp:70: error: expected constructor, destructor, or type conversion before '*' token
factory.cpp:70: error: expected `,' or `;' before '*' token
factory.cpp:99: error: expected constructor, destructor, or type conversion before '*' token
factory.cpp:99: error: expected `,' or `;' before '*' token
In file included from factory.cpp:107:
factory.moc: In member function `virtual void* KDecorationWhid::Factory::qt_cast(const char*)':
factory.moc:73: error: `KDecorationFactory' undeclared (first use this function)
factory.moc:73: error: expected primary-expression before ')' token
factory.moc:73: error: expected `;' before "this"
factory.moc:73: warning: statement has no effect
factory.cpp: At global scope:
factory.cpp:95: warning: 'factory' defined but not used
make[3]: *** [factory.lo] Error 1
make[3]: Leaving directory `/usr/src/release/client'
make[2]: *** [all-recursive] Error 1
make[2]: Leaving directory `/usr/src/release/client'
make[1]: *** [all-recursive] Error 1
make[1]: Leaving directory `/usr/src/release'
make: *** [all] Error 2
[root@rizon release]# - Nov 10 2004