Image 01
profile-image

ruphy

Riccardo Iaconelli Milano, Italy
Plasma Color Schemes
KFTPgrabber

FTP 106 comments

Score 58.0%
Apr 28 2007
With SuSE 9.3 and Kftpgrabber-0.6.0-beta2 I've encourred in this error with make command.
(for commodity I have added the result of ./configure)


-------------------------------------
./configure:


me@linux:~/kftpgrabber-0.6.0-beta2> ./configure
checking build system type... i686-pc-linux-gnu
checking host system type... i686-pc-linux-gnu
checking target system type... i686-pc-linux-gnu
checking for a BSD-compatible install... /usr/bin/install -c
checking for -p flag to install... yes
checking whether build environment is sane... yes
checking for gawk... gawk
checking whether make sets $(MAKE)... yes
checking for kde-config... /opt/kde3/bin/kde-config
checking where to install... /opt/kde3 (as returned by kde-config)
checking for style of include used by make... GNU
checking for gcc... gcc
checking for C compiler default output file name... a.out
checking whether the C compiler works... yes
checking whether we are cross compiling... no
checking for suffix of executables...
checking for suffix of object files... o
checking whether we are using the GNU C compiler... yes
checking whether gcc accepts -g... yes
checking for gcc option to accept ANSI C... none needed
checking dependency style of gcc... gcc3
checking how to run the C preprocessor... gcc -E
checking for g++... g++
checking whether we are using the GNU C++ compiler... yes
checking whether g++ accepts -g... yes
checking dependency style of g++... gcc3
checking whether g++ supports -Wmissing-format-attribute... yes
checking whether gcc supports -Wmissing-format-attribute... yes
checking whether g++ supports -Wundef... yes
checking whether g++ supports -Wno-long-long... yes
checking whether g++ supports -Wnon-virtual-dtor... yes
checking whether g++ supports -fno-exceptions... yes
checking whether g++ supports -fno-check-new... yes
checking whether g++ supports -fno-common... yes
checking whether g++ supports -fexceptions... yes
checking how to run the C++ preprocessor... g++ -E
checking whether g++ supports -O0... yes
checking whether g++ supports -Wl,--no-undefined... yes
checking whether g++ supports -Wl,--allow-shlib-undefined... yes
not using lib directory suffix
checking for a sed that does not truncate output... /usr/bin/sed
checking for egrep... grep -E
checking for ld used by gcc... /usr/i586-suse-linux/bin/ld
checking if the linker (/usr/i586-suse-linux/bin/ld) is GNU ld... yes
checking for /usr/i586-suse-linux/bin/ld option to reload object files... -r
checking for BSD-compatible nm... /usr/bin/nm -B
checking whether ln -s works... yes
checking how to recognise dependent libraries... pass_all
checking for ANSI C header files... yes
checking for sys/types.h... yes
checking for sys/stat.h... yes
checking for stdlib.h... yes
checking for string.h... yes
checking for memory.h... yes
checking for strings.h... yes
checking for inttypes.h... yes
checking for stdint.h... yes
checking for unistd.h... yes
checking dlfcn.h usability... yes
checking dlfcn.h presence... yes
checking for dlfcn.h... yes
checking for g77... no
checking for f77... no
checking for xlf... no
checking for frt... no
checking for pgf77... no
checking for fort77... no
checking for fl32... no
checking for af77... no
checking for f90... no
checking for xlf90... no
checking for pgf90... no
checking for epcf90... no
checking for f95... no
checking for fort... no
checking for xlf95... no
checking for ifc... no
checking for efc... no
checking for pgf95... no
checking for lf95... no
checking for gfortran... no
checking whether we are using the GNU Fortran 77 compiler... no
checking whether accepts -g... no
checking the maximum length of command line arguments... 32768
checking command to parse /usr/bin/nm -B output from gcc object... ok
checking for objdir... .libs
checking for ar... ar
checking for ranlib... ranlib
checking for strip... strip
checking if gcc static flag works... yes
checking if gcc supports -fno-rtti -fno-exceptions... no
checking for gcc option to produce PIC... -fPIC
checking if gcc PIC flag -fPIC works... yes
checking if gcc supports -c -o file.o... yes
checking whether the gcc linker (/usr/i586-suse-linux/bin/ld) supports shared libraries... yes
checking whether -lc should be explicitly linked in... no
checking dynamic linker characteristics... GNU/Linux ld.so
checking how to hardcode library paths into programs... immediate
checking whether stripping libraries is possible... yes
checking for shl_load... no
checking for shl_load in -ldld... no
checking for dlopen... no
checking for dlopen in -ldl... yes
checking whether a program can dlopen itself... yes
checking whether a statically linked program can dlopen itself... yes
checking if libtool supports shared libraries... yes
checking whether to build shared libraries... yes
checking whether to build static libraries... no
configure: creating libtool
appending configuration tag "CXX" to libtool
checking for ld used by g++... /usr/i586-suse-linux/bin/ld
checking if the linker (/usr/i586-suse-linux/bin/ld) is GNU ld... yes
checking whether the g++ linker (/usr/i586-suse-linux/bin/ld) supports shared libraries... yes
checking for g++ option to produce PIC... -fPIC
checking if g++ PIC flag -fPIC works... yes
checking if g++ supports -c -o file.o... yes
checking whether the g++ linker (/usr/i586-suse-linux/bin/ld) supports shared libraries... yes
checking dynamic linker characteristics... GNU/Linux ld.so
checking how to hardcode library paths into programs... immediate
checking whether stripping libraries is possible... yes
checking for shl_load... (cached) no
checking for shl_load in -ldld... (cached) no
checking for dlopen... (cached) no
checking for dlopen in -ldl... (cached) yes
checking whether a program can dlopen itself... (cached) yes
checking whether a statically linked program can dlopen itself... (cached) yes
appending configuration tag "F77" to libtool
checking for msgfmt... /usr/bin/msgfmt
checking for gmsgfmt... /usr/bin/msgfmt
checking for xgettext... /usr/bin/xgettext
checking if C++ programs can be compiled... yes
checking for strlcat... no
checking if strlcat needs custom prototype... yes - in libkdefakes
checking for strlcpy... no
checking if strlcpy needs custom prototype... yes - in libkdefakes
checking for main in -lutil... yes
checking for main in -lcompat... no
checking for crypt in -lcrypt... yes
checking for socklen_t... yes
checking for dnet_ntoa in -ldnet... no
checking for dnet_ntoa in -ldnet_stub... no
checking for inet_ntoa... yes
checking for connect... yes
checking for remove... yes
checking for shmat... yes
checking for sys/types.h... (cached) yes
checking for stdint.h... (cached) yes
checking sys/bitypes.h usability... yes
checking sys/bitypes.h presence... yes
checking for sys/bitypes.h... yes
checking for poll in -lpoll... no
checking CoreAudio/CoreAudio.h usability... no
checking CoreAudio/CoreAudio.h presence... no
checking for CoreAudio/CoreAudio.h... no
checking if res_init needs -lresolv... yes
checking for res_init... yes
checking if res_init needs custom prototype... no
checking for killpg in -lucb... no
checking for int... yes
checking size of int... 4
checking for short... yes
checking size of short... 2
checking for long... yes
checking size of long... 4
checking for char *... yes
checking size of char *... 4
checking for dlopen in -ldl... (cached) yes
checking for shl_unload in -ldld... no
checking for size_t... yes
checking size of size_t... 4
checking for unsigned long... yes
checking size of unsigned long... 4
checking sizeof size_t == sizeof unsigned long... yes
checking crt_externs.h usability... no
checking crt_externs.h presence... no
checking for crt_externs.h... no
checking for _NSGetEnviron... no
checking for vsnprintf... yes
checking for snprintf... yes
checking for X... libraries /usr/X11R6/lib, headers /usr/X11R6/include
checking for IceConnectionNumber in -lICE... yes
checking for libXext... yes
checking for pthread_create in -lpthread... yes
checking for extra includes... no
checking for extra libs... no
checking for libz... -lz
checking for libpng... -lpng -lz -lm
checking for libjpeg6b... no
checking for libjpeg... -ljpeg
checking for perl... /usr/bin/perl
checking for Qt... libraries /usr/lib/qt3/lib, headers /usr/lib/qt3/include using -mt
checking for moc... /usr/lib/qt3/bin/moc
checking for uic... /usr/lib/qt3/bin/uic
checking whether uic supports -L ... yes
checking whether uic supports -nounload ... yes
checking if Qt needs -ljpeg... no
checking for rpath... yes
checking for KDE... libraries /opt/kde3/lib, headers /opt/kde3/include
checking if UIC has KDE plugins available... yes
checking for KDE paths... defaults
checking for dcopidl... /opt/kde3/bin/dcopidl
checking for dcopidl2cpp... /opt/kde3/bin/dcopidl2cpp
checking for mcopidl... /opt/kde3/bin/mcopidl
checking for artsc-config... /opt/kde3/bin/artsc-config
checking for meinproc... /opt/kde3/bin/meinproc
checking for xmllint... /usr/bin/xmllint
checking for gethostbyname in -lresolv... yes
checking for gethostbyname in -lnsl... yes
checking for ANSI C header files... (cached) yes
checking fcntl.h usability... yes
checking fcntl.h presence... yes
checking for fcntl.h... yes
checking netdb.h usability... yes
checking netdb.h presence... yes
checking for netdb.h... yes
checking netinet/in.h usability... yes
checking netinet/in.h presence... yes
checking for netinet/in.h... yes
checking for stdlib.h... (cached) yes
checking for string.h... (cached) yes
checking sys/socket.h usability... yes
checking sys/socket.h presence... yes
checking for sys/socket.h... yes
checking sys/time.h usability... yes
checking sys/time.h presence... yes
checking for sys/time.h... yes
checking termios.h usability... yes
checking termios.h presence... yes
checking for termios.h... yes
checking for unistd.h... (cached) yes
checking openssl/aes.h usability... no
checking openssl/aes.h presence... no
checking for openssl/aes.h... no
checking openssl/blowfish.h usability... no
checking openssl/blowfish.h presence... no
checking for openssl/blowfish.h... no
checking zlib.h usability... yes
checking zlib.h presence... yes
checking for zlib.h... yes
checking sys/poll.h usability... yes
checking sys/poll.h presence... yes
checking for sys/poll.h... yes
checking for stdlib.h... (cached) yes
checking for GNU libc compatible malloc... yes
checking for working memcmp... yes
checking for stdlib.h... (cached) yes
checking for GNU libc compatible realloc... yes
checking sys/select.h usability... yes
checking sys/select.h presence... yes
checking for sys/select.h... yes
checking for sys/socket.h... (cached) yes
checking types of arguments for select... int,fd_set *,struct timeval *
checking return type of signal handlers... void
checking for vprintf... yes
checking for _doprnt... no
checking for endpwent... yes
checking for gethostbyaddr... yes
checking for gethostbyname... yes
checking for getpass... yes
checking for memmove... yes
checking for memset... yes
checking for select... yes
checking for socket... yes
checking for strchr... yes
checking for strdup... yes
checking for strerror... yes
checking for strstr... yes
checking for poll... yes
checking for KDE >= 3.3... yes
checking for KIMProxy support... yes
checking for QSA >= 1.1.0... yes
checking for KDNSSD support... yes
checking whether byte ordering is bigendian... no
checking for MAXPATHLEN... 4096
checking if doc should be compiled... yes
checking if po should be compiled... yes
checking if src should be compiled... yes
configure: creating ./config.status
fast creating Makefile
fast creating doc/Makefile
fast creating doc/en/Makefile
fast creating po/Makefile
fast creating src/Makefile
fast creating src/ftp/Makefile
fast creating src/misc/Makefile
fast creating src/misc/interfaces/Makefile
fast creating src/misc/libs/Makefile
fast creating src/misc/libs/ssh/Makefile
fast creating src/misc/plugins/Makefile
fast creating src/misc/plugins/bookmarkimport/Makefile
fast creating src/misc/plugins/bookmarkimport/gftp/Makefile
fast creating src/misc/plugins/bookmarkimport/ncftp/Makefile
fast creating src/qsa/Makefile
fast creating src/ui/Makefile
fast creating src/widgets/Makefile
fast creating src/widgets/configdialog/Makefile
fast creating src/widgets/filedirview/Makefile
fast creating src/widgets/filtereditor/Makefile
fast creating src/widgets/queueview/Makefile
config.pl: fast created 21 file(s).
config.status: creating config.h
config.status: executing depfiles commands

Good - your configure finished. Start make now


--------------------------------------
make:


me@linux:~/kftpgrabber-0.6.0-beta2> make
make all-recursive
make[1]: Entering directory `/home/me/kftpgrabber-0.6.0-beta2'
Making all in doc
make[2]: Entering directory `/home/me/kftpgrabber-0.6.0-beta2/doc'
Making all in .
make[3]: Entering directory `/home/me/kftpgrabber-0.6.0-beta2/doc'
make[3]: Nothing to be done for `all-am'.
make[3]: Leaving directory `/home/me/kftpgrabber-0.6.0-beta2/doc'
Making all in en
make[3]: Entering directory `/home/me/kftpgrabber-0.6.0-beta2/doc/en'
/opt/kde3/bin/meinproc --check --cache index.cache.bz2 ./index.docbook
make[3]: Leaving directory `/home/me/kftpgrabber-0.6.0-beta2/doc/en'
make[2]: Leaving directory `/home/me/kftpgrabber-0.6.0-beta2/doc'
Making all in po
make[2]: Entering directory `/home/me/kftpgrabber-0.6.0-beta2/po'
rm -f cs.gmo; /usr/bin/msgfmt -o cs.gmo ./cs.po
test ! -f cs.gmo || touch cs.gmo
rm -f de.gmo; /usr/bin/msgfmt -o de.gmo ./de.po
test ! -f de.gmo || touch de.gmo
rm -f es.gmo; /usr/bin/msgfmt -o es.gmo ./es.po
test ! -f es.gmo || touch es.gmo
rm -f fr.gmo; /usr/bin/msgfmt -o fr.gmo ./fr.po
test ! -f fr.gmo || touch fr.gmo
rm -f hu.gmo; /usr/bin/msgfmt -o hu.gmo ./hu.po
test ! -f hu.gmo || touch hu.gmo
rm -f zh_CN.gmo; /usr/bin/msgfmt -o zh_CN.gmo ./zh_CN.po
test ! -f zh_CN.gmo || touch zh_CN.gmo
make[2]: Leaving directory `/home/me/kftpgrabber-0.6.0-beta2/po'
Making all in src
make[2]: Entering directory `/home/me/kftpgrabber-0.6.0-beta2/src'
Making all in ftp
make[3]: Entering directory `/home/me/kftpgrabber-0.6.0-beta2/src/ftp'
/usr/lib/qt3/bin/moc ./kftpclientthread.h -o kftpclientthread.moc
if g++ -DHAVE_CONFIG_H -I. -I. -I../.. -I../../src -I../../src/misc -I../../src/misc/libs -I../../src/widgets -I/opt/kde3/include -I/usr/lib/qt3/include -I/usr/X11R6/include -DQT_THREAD_SUPPORT -D_REENTRANT -Wnon-virtual-dtor -Wno-long-long -Wundef -ansi -D_XOPEN_SOURCE=500 -D_BSD_SOURCE -Wcast-align -Wconversion -Wchar-subscripts -Wall -W -Wpointer-arith -Wwrite-strings -O2 -Wformat-security -Wmissing-format-attribute -fno-exceptions -fno-check-new -fno-common -fexceptions -MT kftpclientthread.o -MD -MP -MF ".deps/kftpclientthread.Tpo" \
-c -o kftpclientthread.o `test -f 'kftpclientthread.cpp' || echo './'`kftpclientthread.cpp; \
then mv -f ".deps/kftpclientthread.Tpo" ".deps/kftpclientthread.Po"; \
else rm -f ".deps/kftpclientthread.Tpo"; exit 1; \
fi
if g++ -DHAVE_CONFIG_H -I. -I. -I../.. -I../../src -I../../src/misc -I../../src/misc/libs -I../../src/widgets -I/opt/kde3/include -I/usr/lib/qt3/include -I/usr/X11R6/include -DQT_THREAD_SUPPORT -D_REENTRANT -Wnon-virtual-dtor -Wno-long-long -Wundef -ansi -D_XOPEN_SOURCE=500 -D_BSD_SOURCE -Wcast-align -Wconversion -Wchar-subscripts -Wall -W -Wpointer-arith -Wwrite-strings -O2 -Wformat-security -Wmissing-format-attribute -fno-exceptions -fno-check-new -fno-common -fexceptions -MT kftpextensions.o -MD -MP -MF ".deps/kftpextensions.Tpo" \
-c -o kftpextensions.o `test -f 'kftpextensions.cpp' || echo './'`kftpextensions.cpp; \
then mv -f ".deps/kftpextensions.Tpo" ".deps/kftpextensions.Po"; \
else rm -f ".deps/kftpextensions.Tpo"; exit 1; \
fi
/usr/lib/qt3/bin/moc ./socket.h -o socket.moc
if g++ -DHAVE_CONFIG_H -I. -I. -I../.. -I../../src -I../../src/misc -I../../src/misc/libs -I../../src/widgets -I/opt/kde3/include -I/usr/lib/qt3/include -I/usr/X11R6/include -DQT_THREAD_SUPPORT -D_REENTRANT -Wnon-virtual-dtor -Wno-long-long -Wundef -ansi -D_XOPEN_SOURCE=500 -D_BSD_SOURCE -Wcast-align -Wconversion -Wchar-subscripts -Wall -W -Wpointer-arith -Wwrite-strings -O2 -Wformat-security -Wmissing-format-attribute -fno-exceptions -fno-check-new -fno-common -fexceptions -MT socket.o -MD -MP -MF ".deps/socket.Tpo" \
-c -o socket.o `test -f 'socket.cpp' || echo './'`socket.cpp; \
then mv -f ".deps/socket.Tpo" ".deps/socket.Po"; \
else rm -f ".deps/socket.Tpo"; exit 1; \
fi
/usr/lib/qt3/bin/moc ./ftpsocket.h -o ftpsocket.moc
if g++ -DHAVE_CONFIG_H -I. -I. -I../.. -I../../src -I../../src/misc -I../../src/misc/libs -I../../src/widgets -I/opt/kde3/include -I/usr/lib/qt3/include -I/usr/X11R6/include -DQT_THREAD_SUPPORT -D_REENTRANT -Wnon-virtual-dtor -Wno-long-long -Wundef -ansi -D_XOPEN_SOURCE=500 -D_BSD_SOURCE -Wcast-align -Wconversion -Wchar-subscripts -Wall -W -Wpointer-arith -Wwrite-strings -O2 -Wformat-security -Wmissing-format-attribute -fno-exceptions -fno-check-new -fno-common -fexceptions -MT ftpsocket.o -MD -MP -MF ".deps/ftpsocket.Tpo" \
-c -o ftpsocket.o `test -f 'ftpsocket.cpp' || echo './'`ftpsocket.cpp; \
then mv -f ".deps/ftpsocket.Tpo" ".deps/ftpsocket.Po"; \
else rm -f ".deps/ftpsocket.Tpo"; exit 1; \
fi
/usr/lib/qt3/bin/moc ./sftpsocket.h -o sftpsocket.moc
if g++ -DHAVE_CONFIG_H -I. -I. -I../.. -I../../src -I../../src/misc -I../../src/misc/libs -I../../src/widgets -I/opt/kde3/include -I/usr/lib/qt3/include -I/usr/X11R6/include -DQT_THREAD_SUPPORT -D_REENTRANT -Wnon-virtual-dtor -Wno-long-long -Wundef -ansi -D_XOPEN_SOURCE=500 -D_BSD_SOURCE -Wcast-align -Wconversion -Wchar-subscripts -Wall -W -Wpointer-arith -Wwrite-strings -O2 -Wformat-security -Wmissing-format-attribute -fno-exceptions -fno-check-new -fno-common -fexceptions -MT sftpsocket.o -MD -MP -MF ".deps/sftpsocket.Tpo" \
-c -o sftpsocket.o `test -f 'sftpsocket.cpp' || echo './'`sftpsocket.cpp; \
then mv -f ".deps/sftpsocket.Tpo" ".deps/sftpsocket.Po"; \
else rm -f ".deps/sftpsocket.Tpo"; exit 1; \
fi
if g++ -DHAVE_CONFIG_H -I. -I. -I../.. -I../../src -I../../src/misc -I../../src/misc/libs -I../../src/widgets -I/opt/kde3/include -I/usr/lib/qt3/include -I/usr/X11R6/include -DQT_THREAD_SUPPORT -D_REENTRANT -Wnon-virtual-dtor -Wno-long-long -Wundef -ansi -D_XOPEN_SOURCE=500 -D_BSD_SOURCE -Wcast-align -Wconversion -Wchar-subscripts -Wall -W -Wpointer-arith -Wwrite-strings -O2 -Wformat-security -Wmissing-format-attribute -fno-exceptions -fno-check-new -fno-common -fexceptions -MT ftpdirectoryparser.o -MD -MP -MF ".deps/ftpdirectoryparser.Tpo" \
-c -o ftpdirectoryparser.o `test -f 'ftpdirectoryparser.cpp' || echo './'`ftpdirectoryparser.cpp; \
then mv -f ".deps/ftpdirectoryparser.Tpo" ".deps/ftpdirectoryparser.Po"; \
else rm -f ".deps/ftpdirectoryparser.Tpo"; exit 1; \
fi
ftpdirectoryparser.cpp: In member function `bool
KFTPNetwork::FtpDirectoryParser::parseUnixDateTime(KFTPNetwork::DLine*,
int&, FTPEntry&)':
ftpdirectoryparser.cpp:532: warning: comparison between signed and unsigned
integer expressions
ftpdirectoryparser.cpp:585: warning: comparison between signed and unsigned
integer expressions
ftpdirectoryparser.cpp: In member function `bool
KFTPNetwork::FtpDirectoryParser::parseShortDate(KFTPNetwork::DToken&,
FTPEntry&)':
ftpdirectoryparser.cpp:693: warning: comparison between signed and unsigned
integer expressions
ftpdirectoryparser.cpp: In member function `bool
KFTPNetwork::FtpDirectoryParser::parseTime(KFTPNetwork::DToken&, FTPEntry&)
':
ftpdirectoryparser.cpp:825: warning: comparison between signed and unsigned
integer expressions
if g++ -DHAVE_CONFIG_H -I. -I. -I../.. -I../../src -I../../src/misc -I../../src/misc/libs -I../../src/widgets -I/opt/kde3/include -I/usr/lib/qt3/include -I/usr/X11R6/include -DQT_THREAD_SUPPORT -D_REENTRANT -Wnon-virtual-dtor -Wno-long-long -Wundef -ansi -D_XOPEN_SOURCE=500 -D_BSD_SOURCE -Wcast-align -Wconversion -Wchar-subscripts -Wall -W -Wpointer-arith -Wwrite-strings -O2 -Wformat-security -Wmissing-format-attribute -fno-exceptions -fno-check-new -fno-common -fexceptions -MT errorhandler.o -MD -MP -MF ".deps/errorhandler.Tpo" \
-c -o errorhandler.o `test -f 'errorhandler.cpp' || echo './'`errorhandler.cpp; \
then mv -f ".deps/errorhandler.Tpo" ".deps/errorhandler.Po"; \
else rm -f ".deps/errorhandler.Tpo"; exit 1; \
fi
/usr/lib/qt3/bin/moc ./errorhandler.h -o errorhandler.moc.cpp
if g++ -DHAVE_CONFIG_H -I. -I. -I../.. -I../../src -I../../src/misc -I../../src/misc/libs -I../../src/widgets -I/opt/kde3/include -I/usr/lib/qt3/include -I/usr/X11R6/include -DQT_THREAD_SUPPORT -D_REENTRANT -Wnon-virtual-dtor -Wno-long-long -Wundef -ansi -D_XOPEN_SOURCE=500 -D_BSD_SOURCE -Wcast-align -Wconversion -Wchar-subscripts -Wall -W -Wpointer-arith -Wwrite-strings -O2 -Wformat-security -Wmissing-format-attribute -fno-exceptions -fno-check-new -fno-common -fexceptions -MT errorhandler.moc.o -MD -MP -MF ".deps/errorhandler.moc.Tpo" \
-c -o errorhandler.moc.o `test -f 'errorhandler.moc.cpp' || echo './'`errorhandler.moc.cpp; \
then mv -f ".deps/errorhandler.moc.Tpo" ".deps/errorhandler.moc.Po"; \
else rm -f ".deps/errorhandler.moc.Tpo"; exit 1; \
fi
rm -f libftp.a
ar cru libftp.a kftpclientthread.o kftpextensions.o socket.o ftpsocket.o sftpsocket.o ftpdirectoryparser.o errorhandler.o errorhandler.moc.o
ranlib libftp.a
make[3]: Leaving directory `/home/me/kftpgrabber-0.6.0-beta2/src/ftp'
Making all in misc
make[3]: Entering directory `/home/me/kftpgrabber-0.6.0-beta2/src/misc'
Making all in interfaces
make[4]: Entering directory `/home/me/kftpgrabber-0.6.0-beta2/src/misc/interfaces'
/usr/lib/qt3/bin/moc ./kftpbookmarkimportplugin.h -o kftpbookmarkimportplugin.moc
if /bin/sh ../../../libtool --silent --mode=compile --tag=CXX g++ -DHAVE_CONFIG_H -I. -I. -I../../.. -I../../../src/ftp -I../../../src/qsa -I/opt/kde3/include -I/usr/lib/qt3/include -I/usr/X11R6/include -DQT_THREAD_SUPPORT -D_REENTRANT -Wnon-virtual-dtor -Wno-long-long -Wundef -ansi -D_XOPEN_SOURCE=500 -D_BSD_SOURCE -Wcast-align -Wconversion -Wchar-subscripts -Wall -W -Wpointer-arith -Wwrite-strings -O2 -Wformat-security -Wmissing-format-attribute -fno-exceptions -fno-check-new -fno-common -MT kftpbookmarkimportplugin.lo -MD -MP -MF ".deps/kftpbookmarkimportplugin.Tpo" \
-c -o kftpbookmarkimportplugin.lo `test -f 'kftpbookmarkimportplugin.cpp' || echo './'`kftpbookmarkimportplugin.cpp; \
then mv -f ".deps/kftpbookmarkimportplugin.Tpo" ".deps/kftpbookmarkimportplugin.Plo"; \
else rm -f ".deps/kftpbookmarkimportplugin.Tpo"; exit 1; \
fi
/bin/sh ../../../libtool --silent --mode=link --tag=CXX g++ -Wnon-virtual-dtor -Wno-long-long -Wundef -ansi -D_XOPEN_SOURCE=500 -D_BSD_SOURCE -Wcast-align -Wconversion -Wchar-subscripts -Wall -W -Wpointer-arith -Wwrite-strings -O2 -Wformat-security -Wmissing-format-attribute -fno-exceptions -fno-check-new -fno-common -o libkftpinterfaces.la -rpath /opt/kde3/lib -L/opt/kde3/lib -L/usr/lib/qt3/lib -L/usr/X11R6/lib -version-info 0:0:0 kftpbookmarkimportplugin.lo -lnsl -lresolv
make[4]: Leaving directory `/home/me/kftpgrabber-0.6.0-beta2/src/misc/interfaces'
Making all in plugins
make[4]: Entering directory `/home/me/kftpgrabber-0.6.0-beta2/src/misc/plugins'
Making all in bookmarkimport
make[5]: Entering directory `/home/me/kftpgrabber-0.6.0-beta2/src/misc/plugins/bookmarkimport'
Making all in gftp
make[6]: Entering directory `/home/me/kftpgrabber-0.6.0-beta2/src/misc/plugins/bookmarkimport/gftp'
/usr/lib/qt3/bin/moc ./kftpimportgftpplugin.h -o kftpimportgftpplugin.moc
if /bin/sh ../../../../../libtool --silent --mode=compile --tag=CXX g++ -DHAVE_CONFIG_H -I. -I. -I../../../../.. -I../../../../../src/misc/interfaces -I/opt/kde3/include -I/usr/lib/qt3/include -I/usr/X11R6/include -DQT_THREAD_SUPPORT -D_REENTRANT -Wnon-virtual-dtor -Wno-long-long -Wundef -ansi -D_XOPEN_SOURCE=500 -D_BSD_SOURCE -Wcast-align -Wconversion -Wchar-subscripts -Wall -W -Wpointer-arith -Wwrite-strings -O2 -Wformat-security -Wmissing-format-attribute -fno-exceptions -fno-check-new -fno-common -MT kftpimportgftpplugin.lo -MD -MP -MF ".deps/kftpimportgftpplugin.Tpo" \
-c -o kftpimportgftpplugin.lo `test -f 'kftpimportgftpplugin.cpp' || echo './'`kftpimportgftpplugin.cpp; \
then mv -f ".deps/kftpimportgftpplugin.Tpo" ".deps/kftpimportgftpplugin.Plo"; \
else rm -f ".deps/kftpimportgftpplugin.Tpo"; exit 1; \
fi
/bin/sh ../../../../../libtool --silent --mode=link --tag=CXX g++ -Wnon-virtual-dtor -Wno-long-long -Wundef -ansi -D_XOPEN_SOURCE=500 -D_BSD_SOURCE -Wcast-align -Wconversion -Wchar-subscripts -Wall -W -Wpointer-arith -Wwrite-strings -O2 -Wformat-security -Wmissing-format-attribute -fno-exceptions -fno-check-new -fno-common -o kftpimportplugin_gftp.la -rpath /opt/kde3/lib/kde3 -module -avoid-version -module -no-undefined -Wl,--no-undefined -Wl,--allow-shlib-undefined -R /opt/kde3/lib -R /usr/lib/qt3/lib -R /usr/X11R6/lib -L/opt/kde3/lib -L/usr/lib/qt3/lib -L/usr/X11R6/lib kftpimportgftpplugin.lo -lkparts ../../../../../src/misc/interfaces/libkftpinterfaces.la -lnsl -lresolv
make[6]: Leaving directory `/home/me/kftpgrabber-0.6.0-beta2/src/misc/plugins/bookmarkimport/gftp'
Making all in ncftp
make[6]: Entering directory `/home/me/kftpgrabber-0.6.0-beta2/src/misc/plugins/bookmarkimport/ncftp'
/usr/lib/qt3/bin/moc ./kftpimportncftpplugin.h -o kftpimportncftpplugin.moc
if /bin/sh ../../../../../libtool --silent --mode=compile --tag=CXX g++ -DHAVE_CONFIG_H -I. -I. -I../../../../.. -I../../../../../src/misc/interfaces -I/opt/kde3/include -I/usr/lib/qt3/include -I/usr/X11R6/include -DQT_THREAD_SUPPORT -D_REENTRANT -Wnon-virtual-dtor -Wno-long-long -Wundef -ansi -D_XOPEN_SOURCE=500 -D_BSD_SOURCE -Wcast-align -Wconversion -Wchar-subscripts -Wall -W -Wpointer-arith -Wwrite-strings -O2 -Wformat-security -Wmissing-format-attribute -fno-exceptions -fno-check-new -fno-common -MT kftpimportncftpplugin.lo -MD -MP -MF ".deps/kftpimportncftpplugin.Tpo" \
-c -o kftpimportncftpplugin.lo `test -f 'kftpimportncftpplugin.cpp' || echo './'`kftpimportncftpplugin.cpp; \
then mv -f ".deps/kftpimportncftpplugin.Tpo" ".deps/kftpimportncftpplugin.Plo"; \
else rm -f ".deps/kftpimportncftpplugin.Tpo"; exit 1; \
fi
/bin/sh ../../../../../libtool --silent --mode=link --tag=CXX g++ -Wnon-virtual-dtor -Wno-long-long -Wundef -ansi -D_XOPEN_SOURCE=500 -D_BSD_SOURCE -Wcast-align -Wconversion -Wchar-subscripts -Wall -W -Wpointer-arith -Wwrite-strings -O2 -Wformat-security -Wmissing-format-attribute -fno-exceptions -fno-check-new -fno-common -o kftpimportplugin_ncftp.la -rpath /opt/kde3/lib/kde3 -module -avoid-version -module -no-undefined -Wl,--no-undefined -Wl,--allow-shlib-undefined -R /opt/kde3/lib -R /usr/lib/qt3/lib -R /usr/X11R6/lib -L/opt/kde3/lib -L/usr/lib/qt3/lib -L/usr/X11R6/lib kftpimportncftpplugin.lo -lkparts ../../../../../src/misc/interfaces/libkftpinterfaces.la -lnsl -lresolv
make[6]: Leaving directory `/home/me/kftpgrabber-0.6.0-beta2/src/misc/plugins/bookmarkimport/ncftp'
make[6]: Entering directory `/home/me/kftpgrabber-0.6.0-beta2/src/misc/plugins/bookmarkimport'
make[6]: Nothing to be done for `all-am'.
make[6]: Leaving directory `/home/me/kftpgrabber-0.6.0-beta2/src/misc/plugins/bookmarkimport'
make[5]: Leaving directory `/home/me/kftpgrabber-0.6.0-beta2/src/misc/plugins/bookmarkimport'
make[5]: Entering directory `/home/me/kftpgrabber-0.6.0-beta2/src/misc/plugins'
make[5]: Nothing to be done for `all-am'.
make[5]: Leaving directory `/home/me/kftpgrabber-0.6.0-beta2/src/misc/plugins'
make[4]: Leaving directory `/home/me/kftpgrabber-0.6.0-beta2/src/misc/plugins'
Making all in libs
make[4]: Entering directory `/home/me/kftpgrabber-0.6.0-beta2/src/misc/libs'
Making all in ssh
make[5]: Entering directory `/home/me/kftpgrabber-0.6.0-beta2/src/misc/libs/ssh'
if gcc -DHAVE_CONFIG_H -I. -I. -I../../../.. -I../../../../src -I../../../../src/ftp -I../../../../src/misc/interfaces -I../../../../src/qsa -I/opt/kde3/include -I/usr/lib/qt3/include -I/usr/X11R6/include -DQT_THREAD_SUPPORT -D_REENTRANT -w -ansi -W -Wall -Wchar-subscripts -Wshadow -Wpointer-arith -Wmissing-prototypes -Wwrite-strings -D_XOPEN_SOURCE=500 -D_BSD_SOURCE -O2 -Wformat-security -Wmissing-format-attribute -MT auth.o -MD -MP -MF ".deps/auth.Tpo" \
-c -o auth.o `test -f 'auth.c' || echo './'`auth.c; \
then mv -f ".deps/auth.Tpo" ".deps/auth.Po"; \
else rm -f ".deps/auth.Tpo"; exit 1; \
fi
In file included from auth.c:22:
priv.h:58:25: openssl/dsa.h: No such file or directory
priv.h:59:25: openssl/rsa.h: No such file or directory
priv.h:60:25: openssl/sha.h: No such file or directory
priv.h:61:25: openssl/md5.h: No such file or directory
priv.h:62:26: openssl/hmac.h: No such file or directory
In file included from auth.c:22:
priv.h:63: error: syntax error before "SHACTX"
priv.h:64: error: syntax error before "MD5CTX"
priv.h:65: error: syntax error before "HMACCTX"
priv.h:74:24: openssl/bn.h: No such file or directory
priv.h:75: error: syntax error before '*' token
priv.h:76: error: syntax error before '*' token
In file included from auth.c:22:
priv.h:98: error: syntax error before '*' token
priv.h:99: error: syntax error before '*' token
priv.h:100: error: syntax error before "MD5CTX"
priv.h:101: error: syntax error before '*' token
priv.h:102: error: syntax error before '*' token
priv.h:103: error: syntax error before "SHACTX"
priv.h:107: error: syntax error before '*' token
priv.h:108: error: syntax error before '*' token
priv.h:109: error: syntax error before '*' token
priv.h:141: error: syntax error before "DSA"
priv.h:143: error: syntax error before '}' token
priv.h:147: error: syntax error before "DSA"
priv.h:149: error: syntax error before '}' token
priv.h:153: error: syntax error before "DSA_SIG"
priv.h:155: error: syntax error before '}' token
priv.h:179: error: syntax error before "bignum"
priv.h:180: error: `SHA_DIGEST_LENGTH' undeclared here (not in a function)
priv.h:182: error: `SHA_DIGEST_LENGTH' undeclared here (not in a function)
priv.h:183: error: `SHA_DIGEST_LENGTH' undeclared here (not in a function)
priv.h:185: error: `SHA_DIGEST_LENGTH' undeclared here (not in a function)
priv.h:186: error: `SHA_DIGEST_LENGTH' undeclared here (not in a function)
priv.h:188: error: `SHA_DIGEST_LENGTH' undeclared here (not in a function)
priv.h:189: error: `SHA_DIGEST_LENGTH' undeclared here (not in a function)
priv.h:190: error: `EVP_MAX_MD_SIZE' undeclared here (not in a function)
priv.h:198: error: syntax error before '}' token
priv.h:243: error: syntax error before "CRYPTO"
priv.h:250: error: syntax error before '}' token
priv.h:279: error: syntax error before "make_string_bn"
priv.h:280: error: syntax error before "num"
priv.h:315: error: syntax error before '*' token
priv.h:316: error: syntax error before '*' token
priv.h:366: error: syntax error before '*' token
priv.h:367: error: syntax error before '*' token
priv.h:368: error: syntax error before "BN_new"
auth.c: In function `ask_userauth':
auth.c:28: error: dereferencing pointer to incomplete type
auth.c:34: error: dereferencing pointer to incomplete type
auth.c: In function `wait_auth_status':
auth.c:60: error: dereferencing pointer to incomplete type
auth.c:62: error: dereferencing pointer to incomplete type
auth.c:63: error: dereferencing pointer to incomplete type
auth.c:97: error: dereferencing pointer to incomplete type
auth.c:103: error: dereferencing pointer to incomplete type
auth.c:104: error: dereferencing pointer to incomplete type
auth.c:105: error: dereferencing pointer to incomplete type
auth.c: In function `ssh_userauth_none':
auth.c:123: error: dereferencing pointer to incomplete type
auth.c:124: error: dereferencing pointer to incomplete type
auth.c:127: error: dereferencing pointer to incomplete type
auth.c:135: error: dereferencing pointer to incomplete type
auth.c:136: error: dereferencing pointer to incomplete type
auth.c:137: error: dereferencing pointer to incomplete type
auth.c:138: error: dereferencing pointer to incomplete type
auth.c: In function `ssh_userauth_offer_pubkey':
auth.c:153: error: dereferencing pointer to incomplete type
auth.c:154: error: dereferencing pointer to incomplete type
auth.c:157: error: dereferencing pointer to incomplete type
auth.c:167: error: dereferencing pointer to incomplete type
auth.c:168: error: dereferencing pointer to incomplete type
auth.c:169: error: dereferencing pointer to incomplete type
auth.c:170: error: dereferencing pointer to incomplete type
auth.c:171: error: dereferencing pointer to incomplete type
auth.c:172: error: dereferencing pointer to incomplete type
auth.c:173: error: dereferencing pointer to incomplete type
auth.c: In function `ssh_userauth_pubkey':
auth.c:191: error: dereferencing pointer to incomplete type
auth.c:192: error: dereferencing pointer to incomplete type
auth.c:195: error: dereferencing pointer to incomplete type
auth.c:202: error: dereferencing pointer to incomplete type
auth.c:207: error: dereferencing pointer to incomplete type
auth.c:208: error: dereferencing pointer to incomplete type
auth.c:209: error: dereferencing pointer to incomplete type
auth.c:210: error: dereferencing pointer to incomplete type
auth.c:211: error: dereferencing pointer to incomplete type
auth.c:212: error: dereferencing pointer to incomplete type
auth.c:213: error: dereferencing pointer to incomplete type
auth.c:214: error: dereferencing pointer to incomplete type
auth.c:216: error: dereferencing pointer to incomplete type
auth.c: In function `ssh_userauth_password':
auth.c:235: error: dereferencing pointer to incomplete type
auth.c:236: error: dereferencing pointer to incomplete type
auth.c:239: error: dereferencing pointer to incomplete type
auth.c:249: error: dereferencing pointer to incomplete type
auth.c:250: error: dereferencing pointer to incomplete type
auth.c:251: error: dereferencing pointer to incomplete type
auth.c:252: error: dereferencing pointer to incomplete type
auth.c:253: error: dereferencing pointer to incomplete type
auth.c:254: error: dereferencing pointer to incomplete type
auth.c: In function `ssh_userauth_autopubkey':
auth.c:283: error: dereferencing pointer to incomplete type
auth.c:284: error: dereferencing pointer to incomplete type
auth.c:285: error: dereferencing pointer to incomplete type
auth.c:287: error: dereferencing pointer to incomplete type
auth.c:288: error: dereferencing pointer to incomplete type
auth.c: In function `kbdauth_init':
auth.c:430: error: dereferencing pointer to incomplete type
auth.c:431: error: dereferencing pointer to incomplete type
auth.c:432: error: dereferencing pointer to incomplete type
auth.c:433: error: dereferencing pointer to incomplete type
auth.c:434: error: dereferencing pointer to incomplete type
auth.c:435: error: dereferencing pointer to incomplete type
auth.c: In function `kbdauth_info_get':
auth.c:451: error: dereferencing pointer to incomplete type
auth.c:452: error: dereferencing pointer to incomplete type
auth.c:453: error: dereferencing pointer to incomplete type
auth.c:454: error: dereferencing pointer to incomplete type
auth.c:466: error: dereferencing pointer to incomplete type
auth.c:467: error: dereferencing pointer to incomplete type
auth.c:469: error: dereferencing pointer to incomplete type
auth.c:470: error: dereferencing pointer to incomplete type
auth.c:472: error: dereferencing pointer to incomplete type
auth.c:479: error: dereferencing pointer to incomplete type
auth.c:480: error: dereferencing pointer to incomplete type
auth.c:481: error: dereferencing pointer to incomplete type
auth.c:482: error: dereferencing pointer to incomplete type
auth.c:483: error: dereferencing pointer to incomplete type
auth.c:485: error: dereferencing pointer to incomplete type
auth.c:486: error: dereferencing pointer to incomplete type
auth.c:486: error: dereferencing pointer to incomplete type
auth.c:491: error: dereferencing pointer to incomplete type
auth.c: In function `kbdauth_send':
auth.c:502: error: dereferencing pointer to incomplete type
auth.c:503: error: dereferencing pointer to incomplete type
auth.c:503: error: dereferencing pointer to incomplete type
auth.c:504: error: dereferencing pointer to incomplete type
auth.c:505: error: dereferencing pointer to incomplete type
auth.c:506: error: dereferencing pointer to incomplete type
auth.c:509: error: dereferencing pointer to incomplete type
auth.c: In function `ssh_userauth_kbdint':
auth.c:521: error: dereferencing pointer to incomplete type
auth.c:524: error: dereferencing pointer to incomplete type
auth.c:525: error: dereferencing pointer to incomplete type
auth.c:528: error: dereferencing pointer to incomplete type
auth.c:537: error: dereferencing pointer to incomplete type
auth.c:538: error: dereferencing pointer to incomplete type
auth.c:547: error: dereferencing pointer to incomplete type
auth.c:548: error: dereferencing pointer to incomplete type
auth.c:553: error: dereferencing pointer to incomplete type
auth.c:554: error: dereferencing pointer to incomplete type
auth.c: In function `ssh_userauth_kbdint_getnprompts':
auth.c:560: error: dereferencing pointer to incomplete type
auth.c: In function `ssh_userauth_kbdint_getname':
auth.c:564: error: dereferencing pointer to incomplete type
auth.c: In function `ssh_userauth_kbdint_getinstruction':
auth.c:568: error: dereferencing pointer to incomplete type
auth.c: In function `ssh_userauth_kbdint_getprompt':
auth.c:573: error: dereferencing pointer to incomplete type
auth.c:576: error: dereferencing pointer to incomplete type
auth.c:577: error: dereferencing pointer to incomplete type
auth.c: In function `ssh_userauth_kbdint_setanswer':
auth.c:581: error: dereferencing pointer to incomplete type
auth.c:583: error: dereferencing pointer to incomplete type
auth.c:584: error: dereferencing pointer to incomplete type
auth.c:584: error: dereferencing pointer to incomplete type
auth.c:585: error: dereferencing pointer to incomplete type
auth.c:585: error: dereferencing pointer to incomplete type
auth.c:587: error: dereferencing pointer to incomplete type
auth.c:588: error: dereferencing pointer to incomplete type
auth.c:589: error: dereferencing pointer to incomplete type
auth.c:591: error: dereferencing pointer to incomplete type
auth.c: At top level:
priv.h:180: error: storage size of `session_id' isn't known
priv.h:182: error: storage size of `encryptIV' isn't known
priv.h:183: error: storage size of `decryptIV' isn't known
priv.h:185: error: storage size of `decryptkey' isn't known
priv.h:186: error: storage size of `encryptkey' isn't known
priv.h:188: error: storage size of `encryptMAC' isn't known
priv.h:189: error: storage size of `decryptMAC' isn't known
priv.h:190: error: storage size of `hmacbuf' isn't known
make[5]: *** [auth.o] Error 1
make[5]: Leaving directory `/home/me/kftpgrabber-0.6.0-beta2/src/misc/libs/ssh'
make[4]: *** [all-recursive] Error 1
make[4]: Leaving directory `/home/me/kftpgrabber-0.6.0-beta2/src/misc/libs'
make[3]: *** [all-recursive] Error 1
make[3]: Leaving directory `/home/me/kftpgrabber-0.6.0-beta2/src/misc'
make[2]: *** [all-recursive] Error 1
make[2]: Leaving directory `/home/me/kftpgrabber-0.6.0-beta2/src'
make[1]: *** [all-recursive] Error 1
make[1]: Leaving directory `/home/me/kftpgrabber-0.6.0-beta2'
make: *** [all] Error 2

---------------------------------------

This is my bug.
Good evening - May 05 2005
Score 82.8%
9   Aug 21 2011
Score 81.5%
9   Aug 21 2011