Image 01
profile-image

seqizz

Gürkan Gür Adana, Turkey
Scale Up

Various KDE 1.-4. Improvements by genericity 7 comments

doesn't compile in kde 4.7:


[ 80%] [100%] Building CXX object CMakeFiles/kcm_kwin4_effect_scaleup.dir/kcm_kwin4_effect_scaleup_automoc.o
Building CXX object CMakeFiles/kcm_kwin4_effect_scaleup.dir/scaleup_config.o
In file included from /tmp/yaourt-tmp-root/aur-kwin-effect-scaleout-git/src/kwin-effect-scaleout/scaleup.cpp:18:0:
/tmp/yaourt-tmp-root/aur-kwin-effect-scaleout-git/src/kwin-effect-scaleout/scaleup.h:41:37: error: ‘TimeLine’ was not declared in this scope
/tmp/yaourt-tmp-root/aur-kwin-effect-scaleout-git/src/kwin-effect-scaleout/scaleup.h:41:46: error: template argument 2 is invalid
/tmp/yaourt-tmp-root/aur-kwin-effect-scaleout-git/src/kwin-effect-scaleout/scaleup.cpp: In member function ‘virtual void KWin::ScaleUpEffect::reconfigure(KWin::Effect::ReconfigureFlags)’:
/tmp/yaourt-tmp-root/aur-kwin-effect-scaleout-git/src/kwin-effect-scaleout/scaleup.cpp:32:18: error: variable ‘KConfigGroup conf’ has initializer but incomplete type
/tmp/yaourt-tmp-root/aur-kwin-effect-scaleout-git/src/kwin-effect-scaleout/scaleup.cpp:32:63: error: invalid use of incomplete type ‘struct KConfigGroup’
/usr/include/kconfigbase.h:32:7: error: forward declaration of ‘struct KConfigGroup’
/tmp/yaourt-tmp-root/aur-kwin-effect-scaleout-git/src/kwin-effect-scaleout/scaleup.cpp: In member function ‘virtual void KWin::ScaleUpEffect::prePaintScreen(KWin::ScreenPrePaintData&, int)’:
/tmp/yaourt-tmp-root/aur-kwin-effect-scaleout-git/src/kwin-effect-scaleout/scaleup.cpp:41:27: error: request for member ‘isEmpty’ in ‘((KWin::ScaleUpEffect*)this)->KWin::ScaleUpEffect::mTimeLineWindows’, which is of non-class type ‘int’
/tmp/yaourt-tmp-root/aur-kwin-effect-scaleout-git/src/kwin-effect-scaleout/scaleup.cpp: In member function ‘virtual void KWin::ScaleUpEffect::prePaintWindow(KWin::EffectWindow*, KWin::WindowPrePaintData&, int)’:
/tmp/yaourt-tmp-root/aur-kwin-effect-scaleout-git/src/kwin-effect-scaleout/scaleup.cpp:48:26: error: request for member ‘contains’ in ‘((KWin::ScaleUpEffect*)this)->KWin::ScaleUpEffect::mTimeLineWindows’, which is of non-class type ‘int’
/tmp/yaourt-tmp-root/aur-kwin-effect-scaleout-git/src/kwin-effect-scaleout/scaleup.cpp:50:31: error: ‘class KWin::EffectWindow’ has no member named ‘addTime’
/tmp/yaourt-tmp-root/aur-kwin-effect-scaleout-git/src/kwin-effect-scaleout/scaleup.cpp:51:35: error: ‘class KWin::EffectWindow’ has no member named ‘value’
/tmp/yaourt-tmp-root/aur-kwin-effect-scaleout-git/src/kwin-effect-scaleout/scaleup.cpp:54:30: error: request for member ‘remove’ in ‘((KWin::ScaleUpEffect*)this)->KWin::ScaleUpEffect::mTimeLineWindows’, which is of non-class type ‘int’
/tmp/yaourt-tmp-root/aur-kwin-effect-scaleout-git/src/kwin-effect-scaleout/scaleup.cpp: In member function ‘virtual void KWin::ScaleUpEffect::paintWindow(KWin::EffectWindow*, int, QRegion, KWin::WindowPaintData&)’:
/tmp/yaourt-tmp-root/aur-kwin-effect-scaleout-git/src/kwin-effect-scaleout/scaleup.cpp:61:26: error: request for member ‘contains’ in ‘((KWin::ScaleUpEffect*)this)->KWin::ScaleUpEffect::mTimeLineWindows’, which is of non-class type ‘int’
/tmp/yaourt-tmp-root/aur-kwin-effect-scaleout-git/src/kwin-effect-scaleout/scaleup.cpp:66:50: error: ‘class KWin::EffectWindow’ has no member named ‘value’
/tmp/yaourt-tmp-root/aur-kwin-effect-scaleout-git/src/kwin-effect-scaleout/scaleup.cpp: In member function ‘virtual void KWin::ScaleUpEffect::postPaintWindow(KWin::EffectWindow*)’:
/tmp/yaourt-tmp-root/aur-kwin-effect-scaleout-git/src/kwin-effect-scaleout/scaleup.cpp:81:26: error: request for member ‘contains’ in ‘((KWin::ScaleUpEffect*)this)->KWin::ScaleUpEffect::mTimeLineWindows’, which is of non-class type ‘int’
/tmp/yaourt-tmp-root/aur-kwin-effect-scaleout-git/src/kwin-effect-scaleout/scaleup.cpp: In member function ‘virtual void KWin::ScaleUpEffect::windowUserMovedResized(KWin::EffectWindow*, bool, bool)’:
/tmp/yaourt-tmp-root/aur-kwin-effect-scaleout-git/src/kwin-effect-scaleout/scaleup.cpp:103:9: error: ‘TimeLine’ was not declared in this scope
/tmp/yaourt-tmp-root/aur-kwin-effect-scaleout-git/src/kwin-effect-scaleout/scaleup.cpp:103:19: error: ‘t’ was not declared in this scope
/tmp/yaourt-tmp-root/aur-kwin-effect-scaleout-git/src/kwin-effect-scaleout/scaleup.cpp:104:26: error: ‘TimeLine’ is not a class or namespace
/tmp/yaourt-tmp-root/aur-kwin-effect-scaleout-git/src/kwin-effect-scaleout/scaleup.cpp: In member function ‘virtual void KWin::ScaleUpEffect::windowClosed(KWin::EffectWindow*)’:
/tmp/yaourt-tmp-root/aur-kwin-effect-scaleout-git/src/kwin-effect-scaleout/scaleup.cpp:118:22: error: request for member ‘remove’ in ‘((KWin::ScaleUpEffect*)this)->KWin::ScaleUpEffect::mTimeLineWindows’, which is of non-class type ‘int’
make[2]: *** [CMakeFiles/kwin4_effect_scaleup.dir/scaleup.o] Error 1
make[1]: *** [CMakeFiles/kwin4_effect_scaleup.dir/all] Error 2
make[1]: *** Waiting for unfinished jobs....
- Aug 03 2011
Gentoo Logo Green KDM4

KDM4 Themes by seqizz 4 comments

sorry for little mistakes :P no time to edit :) - Mar 15 2011
Slim Glow

Plasma Themes by ivancukic 102 comments

Because I don't want to emerge the whole package for 1 theme :)

[ebuild N ] kde-base/kdeartwork-desktopthemes-4.6.1
114,148 kB - Mar 05 2011
Quick Usb Formatter

System Software by chakra-project 32 comments

Here is the tr.po,
Regards..

http://paste.pocoo.org/show/336661/ - Feb 11 2011
Automated Font Installer

Nautilus Scripts by Adaron 19 comments

# Turkish translation by Gürkan Gür (seqizz) #
##########################################################################
# Language Settings ---------------------------------------------------- #
wait='Yazıtipi öncelleği güncelleniyor, lütfen bekleyin'
title_wait='Bitiriliyor'

errors='Bir hata var'
title_errors='Hata'

# End of language settings ----------------------------------------------# - Jun 29 2008
KFaenza

Full Icon Themes
by snakebite

8 .1
Sep 09 2011
Daisy

Plasma 4 Extensions
by Lechio

8 .2
Aug 10 2011
7 .1
3   Sep 12 2014
KotenZA

Full Icon Themes
by pawanyadav

8 .2
9   Jul 25 2013
Ponies Everywhere

Plasma 4 Extensions
by eyecreate

6 .7
3   Sep 23 2011
6 .1
3   Sep 09 2011
4 .6
3   Aug 11 2011
7 .7
9   Aug 09 2011
Night Sky

Wallpaper Other
by CharlieMAC

5 .3
3   Aug 07 2011
Kopete login window

Desktop Concepts
by and1

4 .6
3   Aug 04 2011
5 .3
3   Aug 04 2011
Athkar

Plasma 4 Extensions
by Amine27

6 .4
3   Aug 04 2011
Live Desktop

Screensavers
by copelandrc

6 .3
9   Aug 04 2011
Active Application

Plasma 4 Extensions
by avlas

7 .8
3   Aug 04 2011
Amarok

Audioplayers
by amarok

7 .7
3   Aug 04 2011
BusyTasks

Plasma 4 Extensions
by unknownSpirit

7 .9
9   Aug 04 2011
Androbit

Plasma Themes
by nameless89

7 .8
3   Aug 03 2011
Fragile

Plasma Themes
by garthecho

7 .2
3   Aug 03 2011
win-classic

Plasma Themes
by megabaks

7 .4
3   Aug 03 2011
Titlebar menu

Various KDE 1.-4. Improvements
by johnnybravo

8 .0
3   Aug 03 2011
One Pixel Title

Yakuake Skins
by aspotashev

6 .3
3   Jul 24 2011
6 .7
9   Jul 23 2011