Image 01
profile-image

TheRocket

Rodney Reid
Spell Check

Plasma 4 Extensions by Emdek 16 comments

I am trying to compile on a Debian based system (Mepis 8.5) and I get this error and I don't know what it means, can anyone help me out? Here is the error log:
Compiling the CXX compiler identification source file "CMakeCXXCompilerId.cpp" failed.
Compiler: /usr/bin/gcc
Build flags:
Id flags:

The output was:
1
CMakeCXXCompilerId.cpp:67: warning: deprecated conversion from string constant to 'char*'
CMakeCXXCompilerId.cpp:157: warning: deprecated conversion from string constant to 'char*'
/tmp/cci9ZAMC.o:(.eh_frame+0x12): undefined reference to `__gxx_personality_v0'
collect2: ld returned 1 exit status


Determining if the CXX compiler works failed with the following output:
Change Dir: /home/rodney/Downloads/windowlist-3.1/build/CMakeFiles/CMakeTmp

Run Build Command:/usr/bin/make "cmTryCompileExec/fast"
/usr/bin/make -f CMakeFiles/cmTryCompileExec.dir/build.make CMakeFiles/cmTryCompileExec.dir/build
make[1]: Entering directory `/home/rodney/Downloads/windowlist-3.1/build/CMakeFiles/CMakeTmp'
/usr/bin/cmake -E cmake_progress_report /home/rodney/Downloads/windowlist-3.1/build/CMakeFiles/CMakeTmp/CMakeFiles 1
Building CXX object CMakeFiles/cmTryCompileExec.dir/testCXXCompiler.cxx.o
/usr/bin/gcc -o CMakeFiles/cmTryCompileExec.dir/testCXXCompiler.cxx.o -c /home/rodney/Downloads/windowlist-3.1/build/CMakeFiles/CMakeTmp/testCXXCompiler.cxx
Linking CXX executable cmTryCompileExec
/usr/bin/cmake -E cmake_link_script CMakeFiles/cmTryCompileExec.dir/link.txt --verbose=1
/usr/bin/gcc CMakeFiles/cmTryCompileExec.dir/testCXXCompiler.cxx.o -o cmTryCompileExec -rdynamic
CMakeFiles/cmTryCompileExec.dir/testCXXCompiler.cxx.o:(.eh_frame+0x12): undefined reference to `__gxx_personality_v0'
collect2: ld returned 1 exit status
make[1]: Leaving directory `/home/rodney/Downloads/windowlist-3.1/build/CMakeFiles/CMakeTmp'
make[1]: *** [cmTryCompileExec] Error 1
make: *** [cmTryCompileExec/fast] Error 2




Thanks in advance. - Apr 12 2010
Spell Check

Plasma 4 Extensions by Emdek 16 comments

I am trying to compile on a Debian based system (Mepis 8.5) and I get this error and I don't know what it means, can anyone help me out? Here is the error log:
Compiling the CXX compiler identification source file "CMakeCXXCompilerId.cpp" failed.
Compiler: /usr/bin/gcc
Build flags:
Id flags:

The output was:
1
CMakeCXXCompilerId.cpp:67: warning: deprecated conversion from string constant to 'char*'
CMakeCXXCompilerId.cpp:157: warning: deprecated conversion from string constant to 'char*'
/tmp/cci9ZAMC.o:(.eh_frame+0x12): undefined reference to `__gxx_personality_v0'
collect2: ld returned 1 exit status


Determining if the CXX compiler works failed with the following output:
Change Dir: /home/rodney/Downloads/windowlist-3.1/build/CMakeFiles/CMakeTmp

Run Build Command:/usr/bin/make "cmTryCompileExec/fast"
/usr/bin/make -f CMakeFiles/cmTryCompileExec.dir/build.make CMakeFiles/cmTryCompileExec.dir/build
make[1]: Entering directory `/home/rodney/Downloads/windowlist-3.1/build/CMakeFiles/CMakeTmp'
/usr/bin/cmake -E cmake_progress_report /home/rodney/Downloads/windowlist-3.1/build/CMakeFiles/CMakeTmp/CMakeFiles 1
Building CXX object CMakeFiles/cmTryCompileExec.dir/testCXXCompiler.cxx.o
/usr/bin/gcc -o CMakeFiles/cmTryCompileExec.dir/testCXXCompiler.cxx.o -c /home/rodney/Downloads/windowlist-3.1/build/CMakeFiles/CMakeTmp/testCXXCompiler.cxx
Linking CXX executable cmTryCompileExec
/usr/bin/cmake -E cmake_link_script CMakeFiles/cmTryCompileExec.dir/link.txt --verbose=1
/usr/bin/gcc CMakeFiles/cmTryCompileExec.dir/testCXXCompiler.cxx.o -o cmTryCompileExec -rdynamic
CMakeFiles/cmTryCompileExec.dir/testCXXCompiler.cxx.o:(.eh_frame+0x12): undefined reference to `__gxx_personality_v0'
collect2: ld returned 1 exit status
make[1]: Leaving directory `/home/rodney/Downloads/windowlist-3.1/build/CMakeFiles/CMakeTmp'
make[1]: *** [cmTryCompileExec] Error 1
make: *** [cmTryCompileExec/fast] Error 2




Thanks in advance. - Apr 11 2010