Image 01
profile-image

Trulala

Rusudan Tsiskreli
Wikipedia search

Karamba & Superkaramba by smihael 18 comments

are you going to do new version?
it can't run on superkaramba 0.41 - Nov 16 2006
KIso

Utilities by Mephistoki 81 comments

./configure goes without problems, but during make I resived folowing errors:
l functions but non-virtual destructor
kiso.cpp: In member function ‘virtual void Mainform::choice()’:
kiso.cpp:3177: error: ‘CdIo’ was not declared in this scope
kiso.cpp:3177: error: ‘cdio’ was not declared in this scope
kiso.cpp:3177: error: ‘cdio_open_cd’ was not declared in this scope
kiso.cpp:3179: error: ‘track_t’ was not declared in this scope
kiso.cpp:3179: error: expected `;' before ‘num_tracks’
kiso.cpp:3180: error: expected `;' before ‘first_track_num’
kiso.cpp:3185: error: ‘first_track_num’ was not declared in this scope
kiso.cpp:3185: error: ‘cdio_get_first_track_num’ was not declared in this scope
kiso.cpp:3186: error: ‘num_tracks’ was not declared in this scope
kiso.cpp:3186: error: ‘cdio_get_num_tracks’ was not declared in this scope
kiso.cpp:3187: error: ‘TRACK_FORMAT_AUDIO’ was not declared in this scope
kiso.cpp:3187: error: ‘cdio_get_track_format’ was not declared in this scope
kiso.cpp:3189: error: ‘cdio_destroy’ was not declared in this scope
kiso.cpp:3192: error: ‘TRACK_FORMAT_AUDIO’ was not declared in this scope
kiso.cpp:3192: error: ‘cdio_get_track_format’ was not declared in this scope
kiso.cpp:3195: error: ‘cdio_destroy’ was not declared in this scope
kiso.cpp: In member function ‘virtual void Mainform::createiso(QString)’:
kiso.cpp:3359: error: ‘CdIo’ was not declared in this scope
kiso.cpp:3359: error: ‘cdio’ was not declared in this scope
kiso.cpp:3359: error: ‘cdio_open_cd’ was not declared in this scope
kiso.cpp:3360: error: ‘discmode_t’ was not declared in this scope
kiso.cpp:3360: error: expected `;' before ‘ommodus’
kiso.cpp:3361: error: ‘ommodus’ was not declared in this scope
kiso.cpp:3361: error: ‘cdio_is_discmode_dvd’ was not declared in this scope
kiso.cpp:3363: error: ‘cdio_stat_size’ was not declared in this scope
kiso.cpp:3365: error: ‘CDIO_CD_FRAMESIZE_RAW’ was not declared in this scope
kiso.cpp:3366: error: ‘CDIO_CD_FRAMESIZE’ was not declared in this scope
kiso.cpp:3368: error: ‘track_t’ was not declared in this scope
kiso.cpp:3368: error: expected `;' before ‘num_tracks’
kiso.cpp:3370: error: ‘lsn_t’ was not declared in this scope
kiso.cpp:3370: error: expected `;' before ‘leadoutlsn’
kiso.cpp:3371: error: expected `;' before ‘actuallsn’
kiso.cpp:3372: error: expected `;' before ‘lastlsn’
kiso.cpp:3373: error: ‘leadoutlsn’ was not declared in this scope
kiso.cpp:3373: error: ‘CDIO_CDROM_LEADOUT_TRACK’ was not declared in this scope
kiso.cpp:3373: error: ‘cdio_get_track_lsn’ was not declared in this scope
kiso.cpp:3374: error: ‘lastlsn’ was not declared in this scope
kiso.cpp:3375: error: ‘num_tracks’ was not declared in this scope
kiso.cpp:3375: error: ‘cdio_get_num_tracks’ was not declared in this scope
kiso.cpp:3377: error: ‘TRACK_FORMAT_AUDIO’ was not declared in this scope
kiso.cpp:3377: error: ‘cdio_get_track_format’ was not declared in this scope
kiso.cpp:3379: error: ‘cdio_get_track_lba’ was not declared in this scope
kiso.cpp:3385: error: ‘actuallsn’ was not declared in this scope
kiso.cpp:3387: error: ‘buffer’ was not declared in this scope
kiso.cpp:3387: error: ‘cdio_read_mode1_sector’ was not declared in this scope
kiso.cpp:3399: error: ‘buffer’ was not declared in this scope
kiso.cpp:3399: error: ‘cdio_read_mode1_sector’ was not declared in this scope
kiso.cpp:3404: error: ‘ommodus’ was not declared in this scope
kiso.cpp:3404: error: ‘cdio_is_discmode_dvd’ was not declared in this scope
kiso.cpp:3409: error: ‘cdio_eject_media’ was not declared in this scope
kiso.cpp:3410: error: ‘cdio_destroy’ was not declared in this scope
kiso.cpp: In member function ‘virtual void Mainform::showdrive()’:
kiso.cpp:3562: error: ‘CdIo’ was not declared in this scope
kiso.cpp:3562: error: ‘p_cdio’ was not declared in this scope
kiso.cpp:3565: error: ‘cdio_hwinfo_t’ was not declared in this scope
kiso.cpp:3565: error: expected `;' before ‘p_hw_info’
kiso.cpp:3566: error: ‘DRIVER_DEVICE’ was not declared in this scope
kiso.cpp:3566: error: ‘cdio_open’ was not declared in this scope
kiso.cpp:3569: error: ‘track_t’ was not declared in this scope
kiso.cpp:3569: error: expected `;' before ‘num_tracks’
kiso.cpp:3570: error: expected `;' before ‘first_track_num’
kiso.cpp:3571: error: ‘discmode_t’ was not declared in this scope
kiso.cpp:3571: error: expected `;' before ‘ommodus’
kiso.cpp:3572: error: ‘p_hw_info’ was not declared in this scope
kiso.cpp:3572: error: ‘cdio_get_hwinfo’ was not declared in this scope
kiso.cpp:3575: error: ‘msf_t’ was not declared in this scope
kiso.cpp:3575: error: expected `;' before ‘msf’
kiso.cpp:3576: error: ‘CDIO_CDROM_LEADOUT_TRACK’ was not declared in this scope
kiso.cpp:3576: error: ‘msf’ was not declared in this scope
kiso.cpp:3576: error: ‘cdio_get_track_msf’ was not declared in this scope
kiso.cpp:3577: error: ‘lsn_t’ was not declared in this scope
kiso.cpp:3577: error: expected `;' before ‘lsn’
kiso.cpp:3578: error: ‘lsn’ was not declared in this scope
kiso.cpp:3578: error: ‘CDIO_CD_FRAMESIZE_RAW’ was not declared in this scope
kiso.cpp:3579: error: ‘first_track_num’ was not declared in this scope
kiso.cpp:3579: error: ‘num_tracks’ was not declared in this scope
kiso.cpp:3581: error: ‘TRACK_FORMAT_AUDIO’ was not declared in this scope
kiso.cpp:3581: error: ‘cdio_get_track_format’ was not declared in this scope
kiso.cpp:3583: error: ‘TRACK_FORMAT_DATA’ was not declared in this scope
kiso.cpp:3583: error: ‘cdio_get_track_format’ was not declared in this scope
kiso.cpp:3586: error: ‘cdio_drive_read_cap_t’ was not declared in this scope
kiso.cpp:3586: error: expected `;' before ‘i_read_cap’
kiso.cpp:3587: error: ‘cdio_drive_write_cap_t’ was not declared in this scope
kiso.cpp:3587: error: expected `;' before ‘i_write_cap’
kiso.cpp:3588: error: ‘cdio_drive_misc_cap_t’ was not declared in this scope
kiso.cpp:3588: error: expected `;' before ‘i_misc_cap’
kiso.cpp:3594: error: ‘scsi_mmc_cdb_t’ was not declared in this scope
kiso.cpp:3594: error: expected `;' before ‘cdb’
kiso.cpp:3596: error: ‘cdb’ was not declared in this scope
kiso.cpp:3596: error: ‘CDIO_MMC_GPCMD_GET_CONFIGURATION’ was not declared in this scope
kiso.cpp:3596: error: ‘CDIO_MMC_SET_COMMAND’ was not declared in this scope
kiso.cpp:3597: error: ‘CDIO_MMC_SET_READ_LENGTH8’ was not declared in this scope
kiso.cpp:3598: error: ‘CDIO_MMC_GET_CONF_ALL_FEATURES’ was not declared in this scope
kiso.cpp:3601: error: ‘SCSI_MMC_DATA_READ’ was not declared in this scope
kiso.cpp:3601: error: ‘scsi_mmc_run_cmd’ was not declared in this scope
kiso.cpp:3607: error: ‘CDIO_MMC_GET_LEN32’ was not declared in this scope
kiso.cpp:3613: error: ‘CDIO_MMC_GET_LEN16’ was not declared in this scope
kiso.cpp:3617: error: ‘CDIO_MMC_FEATURE_CORE’ was not declared in this scope
kiso.cpp:3648: error: ‘ommodus’ was not declared in this scope
kiso.cpp:3648: error: ‘cdio_is_discmode_cdrom’ was not declared in this scope
kiso.cpp:3649: error: ‘ommodus’ was not declared in this scope
kiso.cpp:3649: error: ‘CDIO_DISC_MODE_DVD_R’ was not declared in this scope
kiso.cpp:3650: error: ‘ommodus’ was not declared in this scope
kiso.cpp:3650: error: ‘CDIO_DISC_MODE_DVD_RW’ was not declared in this scope
kiso.cpp:3651: error: ‘ommodus’ was not declared in this scope
kiso.cpp:3651: error: ‘CDIO_DISC_MODE_DVD_R’ was not declared in this scope
kiso.cpp:3652: error: ‘ommodus’ was not declared in this scope
kiso.cpp:3652: error: ‘CDIO_DISC_MODE_DVD_ROM’ was not declared in this scope
kiso.cpp:3653: error: ‘ommodus’ was not declared in this scope
kiso.cpp:3653: error: ‘CDIO_DISC_MODE_DVD_RAM’ was not declared in this scope
kiso.cpp:3654: error: ‘ommodus’ was not declared in this scope
kiso.cpp:3654: error: ‘CDIO_DISC_MODE_CD_DA’ was not declared in this scope
kiso.cpp:3655: error: ‘i_read_cap’ was not declared in this scope
kiso.cpp:3655: error: ‘i_write_cap’ was not declared in this scope
kiso.cpp:3655: error: ‘i_misc_cap’ was not declared in this scope
kiso.cpp:3655: error: ‘cdio_get_drive_cap_dev’ was not declared in this scope
kiso.cpp:3656: error: ‘CDIO_DRIVE_CAP_READ_DVD_ROM’ was not declared in this scope
kiso.cpp:3657: error: ‘CDIO_DRIVE_CAP_WRITE_CD_R’ was not declared in this scope
kiso.cpp:3658: error: ‘CDIO_DRIVE_CAP_WRITE_CD_RW’ was not declared in this scope
kiso.cpp:3659: error: ‘CDIO_DRIVE_CAP_WRITE_DVD_R’ was not declared in this scope
kiso.cpp:3660: error: ‘CDIO_DRIVE_CAP_WRITE_DVD_RW’ was not declared in this scope
kiso.cpp:3666: error: ‘cdio_destroy’ was not declared in this scope
kiso.cpp: In member function ‘virtual int Mainform::ProgressBar(QString, QString, KShellProcess*, double)’:
kiso.cpp:3676: error: ‘lba_t’ was not declared in this scope
kiso.cpp:3676: error: expected `;' before ‘first_audio_lba’
kiso.cpp:3679: error: ‘CdIo’ was not declared in this scope
kiso.cpp:3679: error: ‘cdio’ was not declared in this scope
kiso.cpp:3679: error: ‘cdio_open_cd’ was not declared in this scope
kiso.cpp:3680: error: ‘track_t’ was not declared in this scope
kiso.cpp:3680: error: expected `;' before ‘num_tracks’
kiso.cpp:3681: error: expected `;' before ‘first_track_num’
kiso.cpp:3682: error: ‘first_track_num’ was not declared in this scope
kiso.cpp:3682: error: ‘num_tracks’ was not declared in this scope
kiso.cpp:3683: error: ‘TRACK_FORMAT_AUDIO’ was not declared in this scope
kiso.cpp:3683: error: ‘cdio_get_track_format’ was not declared in this scope
kiso.cpp:3684: error: ‘first_audio_lba’ was not declared in this scope
kiso.cpp:3685: error: ‘cdio_get_track_lba’ was not declared in this scope
kiso.cpp:3689: error: ‘cdio_stat_size’ was not declared in this scope
kiso.cpp:3690: error: ‘cdio_destroy’ was not declared in this scope
make[2]: *** [kiso.o] Error 1
make[2]: Leaving directory `/home/Install/kiso-0.8.3/src'
make[1]: *** [all-recursive] Error 1
make[1]: Leaving directory `/home/Install/kiso-0.8.3'
make: *** [all] Error 2


please help me, what have I to do? - May 29 2006
KFTPgrabber

FTP by Kostko 106 comments

& in file
/kftpgrabber/src/ui/kftpsearchlayout.cpp
remove or comment line 25 "#include "kftpserverlineedit.h""

I couldn`t find this file.......... - May 28 2006
Kopete DeskList Plugin

Various KDE 1.-4. Improvements by conrausch 118 comments

I compiled plugin, it compiled without errors, but I can`t see it in kopete modules list. how to use it? - Apr 12 2006
KPhone

Various KDE Stuff by mtm 16 comments

it would be great to have integration with kontact. are you going to do that? - Apr 04 2006
KCall

Telephony by evabrucherseifer 20 comments

Iinstalled it and like integration with kaddressbook very much, but cant understand, how to answer calls? I try to call from house phone, and call was made, I saw ball in the tray but couldn`t find how to answer... please explain me....
and next, I`d like to see more options, for example to get pop up windows on incoming calls.... - Apr 03 2006
Green splash

KDE 3.x Splash Screens by tuxxland 5 comments

controm center seays that for This splashscreen I need Moodin plugin. where can I get it? splash screen is realy nice - Mar 24 2006
KLingvoOnline

Utilities by serega 20 comments

I needed libacl-devel, I installed it and make finished without errors, but hm... very stupid question, but after make install where is executable?
anyway, it must be very good and really nessesery utility for all Russian speakers so thank you very much!!! - Jan 22 2006
KLingvoOnline

Utilities by serega 20 comments

hm, I have searchen, but everything what contained acl, include libacl is installed.... - Jan 22 2006
KLingvoOnline

Utilities by serega 20 comments

I have added khtml_ext.h in /opt/kde3/include, but still have trobles
here is output of make:
make all-recursive
make[1]: Entering directory `/home/Trulala/klingvotranslator'
Making all in doc
make[2]: Entering directory `/home/Trulala/klingvotranslator/doc'
Making all in .
make[3]: Entering directory `/home/Trulala/klingvotranslator/doc'
make[3]: Nothing to be done for `all-am'.
make[3]: Leaving directory `/home/Trulala/klingvotranslator/doc'
Making all in en
make[3]: Entering directory `/home/Trulala/klingvotranslator/doc/en'
make[3]: Nothing to be done for `all'.
make[3]: Leaving directory `/home/Trulala/klingvotranslator/doc/en'
make[2]: Leaving directory `/home/Trulala/klingvotranslator/doc'
Making all in po
make[2]: Entering directory `/home/Trulala/klingvotranslator/po'
make[2]: Nothing to be done for `all'.
make[2]: Leaving directory `/home/Trulala/klingvotranslator/po'
Making all in src
make[2]: Entering directory `/home/Trulala/klingvotranslator/src'
if /bin/sh ../libtool --silent --tag=CXX --mode=compile g++ -DHAVE_CONFIG_H -I. -I. -I.. -I/opt/kde3/include -I/usr/lib/qt3/include -I/usr/X11R6/include -DQT_THREAD_SUPPORT -D_REENTRANT -Wno-long-long -Wundef -ansi -D_XOPEN_SOURCE=500 -D_BSD_SOURCE -Wcast-align -Wconversion -Wchar-subscripts -Wall -W -Wpointer-arith -O2 -Wformat-security -Wmissing-format-attribute -Wno-non-virtual-dtor -fno-exceptions -fno-check-new -fno-common -MT browser.lo -MD -MP -MF ".deps/browser.Tpo" -c -o browser.lo browser.cpp; \
then mv -f ".deps/browser.Tpo" ".deps/browser.Plo"; else rm -f ".deps/browser.Tpo"; exit 1; fi
/bin/sh ../libtool --silent --tag=CXX --mode=link g++ -Wno-long-long -Wundef -ansi -D_XOPEN_SOURCE=500 -D_BSD_SOURCE -Wcast-align -Wconversion -Wchar-subscripts -Wall -W -Wpointer-arith -O2 -Wformat-security -Wmissing-format-attribute -Wno-non-virtual-dtor -fno-exceptions -fno-check-new -fno-common -o klingvotranslator.la -rpath /opt/kde3/lib/kde3 -module -avoid-version -module -no-undefined -Wl,--no-undefined -Wl,--allow-shlib-undefined -R /opt/kde3/lib -R /opt/kde3/lib -R /usr/lib/qt3/lib -R /usr/X11R6/lib -L/opt/kde3/lib -L/usr/lib/qt3/lib -L/usr/X11R6/lib klingvotranslator.lo textencoder.lo browser.lo languagechooser.lo settings.lo browser_prefs.lo prefs.lo -lkio -lkdeui -lkhtml
/usr/lib/gcc/i586-suse-linux/4.0.2/../../../../i586-suse-linux/bin/ld: cannot find -lacl
collect2: ld returned 1 exit status
make[2]: *** [klingvotranslator.la] Error 1
make[2]: Leaving directory `/home/Trulala/klingvotranslator/src'
make[1]: *** [all-recursive] Error 1
make[1]: Leaving directory `/home/Trulala/klingvotranslator'
make: *** [all] Error 2 - Jan 21 2006
KLingvoOnline

Utilities by serega 20 comments

kde 3.5

make all-recursive
make[1]: Entering directory `/home/Trulala/klingvotranslator'
Making all in doc
make[2]: Entering directory `/home/Trulala/klingvotranslator/doc'
Making all in .
make[3]: Entering directory `/home/Trulala/klingvotranslator/doc'
make[3]: Nothing to be done for `all-am'.
make[3]: Leaving directory `/home/Trulala/klingvotranslator/doc'
Making all in en
make[3]: Entering directory `/home/Trulala/klingvotranslator/doc/en'
make[3]: Nothing to be done for `all'.
make[3]: Leaving directory `/home/Trulala/klingvotranslator/doc/en'
make[2]: Leaving directory `/home/Trulala/klingvotranslator/doc'
Making all in po
make[2]: Entering directory `/home/Trulala/klingvotranslator/po'
make[2]: Nothing to be done for `all'.
make[2]: Leaving directory `/home/Trulala/klingvotranslator/po'
Making all in src
make[2]: Entering directory `/home/Trulala/klingvotranslator/src'
if /bin/sh ../libtool --silent --tag=CXX --mode=compile g++ -DHAVE_CONFIG_H -I. -I. -I.. -I/opt/kde3/include -I/usr/lib/qt3/include -I/usr/X11R6/include -DQT_THREAD_SUPPORT -D_REENTRANT -Wno-long-long -Wundef -ansi -D_XOPEN_SOURCE=500 -D_BSD_SOURCE -Wcast-align -Wconversion -Wchar-subscripts -Wall -W -Wpointer-arith -O2 -Wformat-security -Wmissing-format-attribute -Wno-non-virtual-dtor -fno-exceptions -fno-check-new -fno-common -MT browser.lo -MD -MP -MF ".deps/browser.Tpo" -c -o browser.lo browser.cpp; \
then mv -f ".deps/browser.Tpo" ".deps/browser.Plo"; else rm -f ".deps/browser.Tpo"; exit 1; fi
browser.cpp:28:23: error: khtml_ext.h: No such file or directory
browser.cpp: In member function 'void BrowserImpl::reconfigure()':
browser.cpp:66: error: invalid use of undefined type 'struct KHTMLPartBrowserExtension'
/opt/kde3/include/khtml_part.h:40: error: forward declaration of 'struct KHTMLPartBrowserExtension'
browser.cpp:67: error: invalid use of undefined type 'struct KHTMLPartBrowserExtension'
/opt/kde3/include/khtml_part.h:40: error: forward declaration of 'struct KHTMLPartBrowserExtension'
make[2]: *** [browser.lo] Error 1
make[2]: Leaving directory `/home/Trulala/klingvotranslator/src'
make[1]: *** [all-recursive] Error 1
make[1]: Leaving directory `/home/Trulala/klingvotranslator'
make: *** [all] Error 2 - Jan 21 2006
Kniga

Office Apps by vladsv 20 comments

after running ./install.sh I resived such output:
./install.sh: line 2: lrelease: command not found
./install.sh: line 3: qmake: command not found
make: *** No targets specified and no makefile found. Stop.
make: `install' is up to date.
./install.sh: line 7: update-menus: command not found
and after running ./kniga.pro
Trulala:/home/Trulala/kniga # ./kniga.pro
./kniga.pro: line 6: TEMPLATE: command not found
./kniga.pro: line 7: CONFIG: command not found
./kniga.pro: line 11: TARGET: command not found
./kniga.pro: line 12: SOURCES: command not found
./kniga.pro: line 24: HEADERS: command not found
./kniga.pro: line 36: IMAGES: command not found
./kniga.pro: line 56: DISTFILES: command not found
./kniga.pro: line 62: TRANSLATIONS: command not found
./kniga.pro: line 64: qm.path: command not found
./kniga.pro: line 65: qm.files: command not found
./kniga.pro: line 67: doc.path: command not found
./kniga.pro: line 68: doc.files: command not found
./kniga.pro: line 73: pix.path: command not found
./kniga.pro: line 74: pix.files: command not found
./kniga.pro: line 76: desktop.path: command not found
./kniga.pro: line 77: desktop.files: command not found
./kniga.pro: line 79: target.path: command not found
./kniga.pro: line 81: INSTALLS: command not found - Nov 14 2005